{"text_format":"1","workbook":"xlsx","n_sheets":12,"sheets":["Leaderboard","August","September","October","November","December","January","February","March","April","May","Jokers"],"not_rendered":{"charts":0,"images":11,"macros":1,"external_links":0,"defined_names":0,"comments":0,"pivot_tables":0},"unopened":[],"bounds":{"document_bytes":16777216,"sheet_cells":100000,"rows_first":2000,"rows_last":500,"rows_between":2000,"halvings":0,"cell_chars":16384,"cell_head_chars":4096},"cells_cut":0,"cells_raw":0,"read":"whole","date_system":"1900"}

{"sheet":"Leaderboard","index":0,"n_rows":80,"n_cols":14,"rows_kept":80,"cut":false,"hidden":false,"merged":[]}
[]
[]
[]
[]
[]
["No.","Player","Team Name","2014-08-01","2014-09-01","2014-10-01","2014-11-01","2014-12-01","2015-01-01","2015-02-01","2015-03-01","2015-04-01","2015-05-01","Total"]
[1,"Ralph Goodwin","Sky Blue Army",{"$f":"HLOOKUP(B7,August!$G$1:$CB$87,87,FALSE)","v":110},{"$f":"HLOOKUP(B7,September!$G$1:$CB$87,87,FALSE)","v":110},{"$f":"HLOOKUP(B7,October!$G$1:$CB$87,87,FALSE)","v":130},{"$f":"HLOOKUP(B7,November!$G$1:$CB$102,102,FALSE)","v":155},{"$f":"HLOOKUP(B7,December!$G$1:$CB$129,129,FALSE)","v":245},{"$f":"HLOOKUP(B7,January!$G$1:$CB$71,71,FALSE)","v":135},{"$f":"HLOOKUP(B7,February!$G$1:$CB$73,73,FALSE)","v":135},{"$f":"HLOOKUP(B7,March!$G$1:$CB$70,70,FALSE)","v":155},{"$f":"HLOOKUP(B7,April!$G$1:$CB$85,85,FALSE)","v":125},{"$f":"HLOOKUP(B7,May!$G$1:$CB$82,82,FALSE)","v":180},{"$f":"SUM(D7:M7)","v":1480}]
[2,"Con McSweeney","Glassey_Alleys",{"$f":"HLOOKUP(B8,August!$G$1:$CB$87,87,FALSE)","v":105},{"$f":"HLOOKUP(B8,September!$G$1:$CB$87,87,FALSE)","v":115},{"$f":"HLOOKUP(B8,October!$G$1:$CB$87,87,FALSE)","v":170},{"$f":"HLOOKUP(B8,November!$G$1:$CB$102,102,FALSE)","v":125},{"$f":"HLOOKUP(B8,December!$G$1:$CB$129,129,FALSE)","v":250},{"$f":"HLOOKUP(B8,January!$G$1:$CB$71,71,FALSE)","v":145},{"$f":"HLOOKUP(B8,February!$G$1:$CB$73,73,FALSE)","v":115},{"$f":"HLOOKUP(B8,March!$G$1:$CB$70,70,FALSE)","v":145},{"$f":"HLOOKUP(B8,April!$G$1:$CB$85,85,FALSE)","v":130},{"$f":"HLOOKUP(B8,May!$G$1:$CB$82,82,FALSE)","v":170},{"$f":"SUM(D8:M8)","v":1470}]
[3,"Brian Sotolongo","Punchin' Horses For Fun",{"$f":"HLOOKUP(B9,August!$G$1:$CB$87,87,FALSE)","v":120},{"$f":"HLOOKUP(B9,September!$G$1:$CB$87,87,FALSE)","v":135},{"$f":"HLOOKUP(B9,October!$G$1:$CB$87,87,FALSE)","v":140},{"$f":"HLOOKUP(B9,November!$G$1:$CB$102,102,FALSE)","v":195},{"$f":"HLOOKUP(B9,December!$G$1:$CB$129,129,FALSE)","v":205},{"$f":"HLOOKUP(B9,January!$G$1:$CB$71,71,FALSE)","v":140},{"$f":"HLOOKUP(B9,February!$G$1:$CB$73,73,FALSE)","v":110},{"$f":"HLOOKUP(B9,March!$G$1:$CB$70,70,FALSE)","v":145},{"$f":"HLOOKUP(B9,April!$G$1:$CB$85,85,FALSE)","v":110},{"$f":"HLOOKUP(B9,May!$G$1:$CB$82,82,FALSE)","v":160},{"$f":"SUM(D9:M9)","v":1460}]
[4,"Padraic Carney","Sheep Shaggers",{"$f":"HLOOKUP(B10,August!$G$1:$CB$87,87,FALSE)","v":135},{"$f":"HLOOKUP(B10,September!$G$1:$CB$87,87,FALSE)","v":120},{"$f":"HLOOKUP(B10,October!$G$1:$CB$87,87,FALSE)","v":140},{"$f":"HLOOKUP(B10,November!$G$1:$CB$102,102,FALSE)","v":135},{"$f":"HLOOKUP(B10,December!$G$1:$CB$129,129,FALSE)","v":240},{"$f":"HLOOKUP(B10,January!$G$1:$CB$71,71,FALSE)","v":125},{"$f":"HLOOKUP(B10,February!$G$1:$CB$73,73,FALSE)","v":125},{"$f":"HLOOKUP(B10,March!$G$1:$CB$70,70,FALSE)","v":125},{"$f":"HLOOKUP(B10,April!$G$1:$CB$85,85,FALSE)","v":130},{"$f":"HLOOKUP(B10,May!$G$1:$CB$82,82,FALSE)","v":155},{"$f":"SUM(D10:M10)","v":1430}]
[5,"Dave McGinley","Reservoir Dubs",{"$f":"HLOOKUP(B11,August!$G$1:$CB$87,87,FALSE)","v":110},{"$f":"HLOOKUP(B11,September!$G$1:$CB$87,87,FALSE)","v":150},{"$f":"HLOOKUP(B11,October!$G$1:$CB$87,87,FALSE)","v":150},{"$f":"HLOOKUP(B11,November!$G$1:$CB$102,102,FALSE)","v":140},{"$f":"HLOOKUP(B11,December!$G$1:$CB$129,129,FALSE)","v":210},{"$f":"HLOOKUP(B11,January!$G$1:$CB$71,71,FALSE)","v":105},{"$f":"HLOOKUP(B11,February!$G$1:$CB$73,73,FALSE)","v":110},{"$f":"HLOOKUP(B11,March!$G$1:$CB$70,70,FALSE)","v":145},{"$f":"HLOOKUP(B11,April!$G$1:$CB$85,85,FALSE)","v":150},{"$f":"HLOOKUP(B11,May!$G$1:$CB$82,82,FALSE)","v":150},{"$f":"SUM(D11:M11)","v":1420}]
[6,"Anastas Popov","FC Botev",{"$f":"HLOOKUP(B12,August!$G$1:$CB$87,87,FALSE)","v":105},{"$f":"HLOOKUP(B12,September!$G$1:$CB$87,87,FALSE)","v":115},{"$f":"HLOOKUP(B12,October!$G$1:$CB$87,87,FALSE)","v":135},{"$f":"HLOOKUP(B12,November!$G$1:$CB$102,102,FALSE)","v":105},{"$f":"HLOOKUP(B12,December!$G$1:$CB$129,129,FALSE)","v":260},{"$f":"HLOOKUP(B12,January!$G$1:$CB$71,71,FALSE)","v":115},{"$f":"HLOOKUP(B12,February!$G$1:$CB$73,73,FALSE)","v":125},{"$f":"HLOOKUP(B12,March!$G$1:$CB$70,70,FALSE)","v":180},{"$f":"HLOOKUP(B12,April!$G$1:$CB$85,85,FALSE)","v":130},{"$f":"HLOOKUP(B12,May!$G$1:$CB$82,82,FALSE)","v":145},{"$f":"SUM(D12:M12)","v":1415}]
[7,"Eamon Fox","Saoirkat",{"$f":"HLOOKUP(B13,August!$G$1:$CB$87,87,FALSE)","v":110},{"$f":"HLOOKUP(B13,September!$G$1:$CB$87,87,FALSE)","v":120},{"$f":"HLOOKUP(B13,October!$G$1:$CB$87,87,FALSE)","v":150},{"$f":"HLOOKUP(B13,November!$G$1:$CB$102,102,FALSE)","v":115},{"$f":"HLOOKUP(B13,December!$G$1:$CB$129,129,FALSE)","v":270},{"$f":"HLOOKUP(B13,January!$G$1:$CB$71,71,FALSE)","v":145},{"$f":"HLOOKUP(B13,February!$G$1:$CB$73,73,FALSE)","v":105},{"$f":"HLOOKUP(B13,March!$G$1:$CB$70,70,FALSE)","v":135},{"$f":"HLOOKUP(B13,April!$G$1:$CB$85,85,FALSE)","v":125},{"$f":"HLOOKUP(B13,May!$G$1:$CB$82,82,FALSE)","v":125},{"$f":"SUM(D13:M13)","v":1400}]
[8,"Gavin Morgan","Route One",{"$f":"HLOOKUP(B14,August!$G$1:$CB$87,87,FALSE)","v":85},{"$f":"HLOOKUP(B14,September!$G$1:$CB$87,87,FALSE)","v":105},{"$f":"HLOOKUP(B14,October!$G$1:$CB$87,87,FALSE)","v":155},{"$f":"HLOOKUP(B14,November!$G$1:$CB$102,102,FALSE)","v":160},{"$f":"HLOOKUP(B14,December!$G$1:$CB$129,129,FALSE)","v":220},{"$f":"HLOOKUP(B14,January!$G$1:$CB$71,71,FALSE)","v":115},{"$f":"HLOOKUP(B14,February!$G$1:$CB$73,73,FALSE)","v":155},{"$f":"HLOOKUP(B14,March!$G$1:$CB$70,70,FALSE)","v":150},{"$f":"HLOOKUP(B14,April!$G$1:$CB$85,85,FALSE)","v":105},{"$f":"HLOOKUP(B14,May!$G$1:$CB$82,82,FALSE)","v":150},{"$f":"SUM(D14:M14)","v":1400}]
[9,"David Bone","Brunton Blues",{"$f":"HLOOKUP(B15,August!$G$1:$CB$87,87,FALSE)","v":105},{"$f":"HLOOKUP(B15,September!$G$1:$CB$87,87,FALSE)","v":75},{"$f":"HLOOKUP(B15,October!$G$1:$CB$87,87,FALSE)","v":155},{"$f":"HLOOKUP(B15,November!$G$1:$CB$102,102,FALSE)","v":175},{"$f":"HLOOKUP(B15,December!$G$1:$CB$129,129,FALSE)","v":235},{"$f":"HLOOKUP(B15,January!$G$1:$CB$71,71,FALSE)","v":120},{"$f":"HLOOKUP(B15,February!$G$1:$CB$73,73,FALSE)","v":110},{"$f":"HLOOKUP(B15,March!$G$1:$CB$70,70,FALSE)","v":145},{"$f":"HLOOKUP(B15,April!$G$1:$CB$85,85,FALSE)","v":130},{"$f":"HLOOKUP(B15,May!$G$1:$CB$82,82,FALSE)","v":145},{"$f":"SUM(D15:M15)","v":1395}]
[10,"Barry Healy","Dangleberries United",{"$f":"HLOOKUP(B16,August!$G$1:$CB$87,87,FALSE)","v":115},{"$f":"HLOOKUP(B16,September!$G$1:$CB$87,87,FALSE)","v":125},{"$f":"HLOOKUP(B16,October!$G$1:$CB$87,87,FALSE)","v":100},{"$f":"HLOOKUP(B16,November!$G$1:$CB$102,102,FALSE)","v":135},{"$f":"HLOOKUP(B16,December!$G$1:$CB$129,129,FALSE)","v":265},{"$f":"HLOOKUP(B16,January!$G$1:$CB$71,71,FALSE)","v":130},{"$f":"HLOOKUP(B16,February!$G$1:$CB$73,73,FALSE)","v":115},{"$f":"HLOOKUP(B16,March!$G$1:$CB$70,70,FALSE)","v":135},{"$f":"HLOOKUP(B16,April!$G$1:$CB$85,85,FALSE)","v":130},{"$f":"HLOOKUP(B16,May!$G$1:$CB$82,82,FALSE)","v":140},{"$f":"SUM(D16:M16)","v":1390}]
[11,"Brian Prendergast","Gunnersaurus",{"$f":"HLOOKUP(B17,August!$G$1:$CB$87,87,FALSE)","v":115},{"$f":"HLOOKUP(B17,September!$G$1:$CB$87,87,FALSE)","v":140},{"$f":"HLOOKUP(B17,October!$G$1:$CB$87,87,FALSE)","v":115},{"$f":"HLOOKUP(B17,November!$G$1:$CB$102,102,FALSE)","v":135},{"$f":"HLOOKUP(B17,December!$G$1:$CB$129,129,FALSE)","v":250},{"$f":"HLOOKUP(B17,January!$G$1:$CB$71,71,FALSE)","v":115},{"$f":"HLOOKUP(B17,February!$G$1:$CB$73,73,FALSE)","v":100},{"$f":"HLOOKUP(B17,March!$G$1:$CB$70,70,FALSE)","v":170},{"$f":"HLOOKUP(B17,April!$G$1:$CB$85,85,FALSE)","v":135},{"$f":"HLOOKUP(B17,May!$G$1:$CB$82,82,FALSE)","v":115},{"$f":"SUM(D17:M17)","v":1390}]
[12,"Gerry Draper","Everton 10",{"$f":"HLOOKUP(B18,August!$G$1:$CB$87,87,FALSE)","v":120},{"$f":"HLOOKUP(B18,September!$G$1:$CB$87,87,FALSE)","v":95},{"$f":"HLOOKUP(B18,October!$G$1:$CB$87,87,FALSE)","v":140},{"$f":"HLOOKUP(B18,November!$G$1:$CB$102,102,FALSE)","v":135},{"$f":"HLOOKUP(B18,December!$G$1:$CB$129,129,FALSE)","v":250},{"$f":"HLOOKUP(B18,January!$G$1:$CB$71,71,FALSE)","v":140},{"$f":"HLOOKUP(B18,February!$G$1:$CB$73,73,FALSE)","v":95},{"$f":"HLOOKUP(B18,March!$G$1:$CB$70,70,FALSE)","v":130},{"$f":"HLOOKUP(B18,April!$G$1:$CB$85,85,FALSE)","v":145},{"$f":"HLOOKUP(B18,May!$G$1:$CB$82,82,FALSE)","v":140},{"$f":"SUM(D18:M18)","v":1390}]
[13,"Colin McAnaspie","AC A Little Silhouette of Milan",{"$f":"HLOOKUP(B19,August!$G$1:$CB$87,87,FALSE)","v":105},{"$f":"HLOOKUP(B19,September!$G$1:$CB$87,87,FALSE)","v":135},{"$f":"HLOOKUP(B19,October!$G$1:$CB$87,87,FALSE)","v":140},{"$f":"HLOOKUP(B19,November!$G$1:$CB$102,102,FALSE)","v":145},{"$f":"HLOOKUP(B19,December!$G$1:$CB$129,129,FALSE)","v":235},{"$f":"HLOOKUP(B19,January!$G$1:$CB$71,71,FALSE)","v":110},{"$f":"HLOOKUP(B19,February!$G$1:$CB$73,73,FALSE)","v":115},{"$f":"HLOOKUP(B19,March!$G$1:$CB$70,70,FALSE)","v":140},{"$f":"HLOOKUP(B19,April!$G$1:$CB$85,85,FALSE)","v":125},{"$f":"HLOOKUP(B19,May!$G$1:$CB$82,82,FALSE)","v":135},{"$f":"SUM(D19:M19)","v":1385}]
[14,"Paul Prendergast","The Untouchables",{"$f":"HLOOKUP(B20,August!$G$1:$CB$87,87,FALSE)","v":105},{"$f":"HLOOKUP(B20,September!$G$1:$CB$87,87,FALSE)","v":110},{"$f":"HLOOKUP(B20,October!$G$1:$CB$87,87,FALSE)","v":130},{"$f":"HLOOKUP(B20,November!$G$1:$CB$102,102,FALSE)","v":160},{"$f":"HLOOKUP(B20,December!$G$1:$CB$129,129,FALSE)","v":230},{"$f":"HLOOKUP(B20,January!$G$1:$CB$71,71,FALSE)","v":120},{"$f":"HLOOKUP(B20,February!$G$1:$CB$73,73,FALSE)","v":140},{"$f":"HLOOKUP(B20,March!$G$1:$CB$70,70,FALSE)","v":130},{"$f":"HLOOKUP(B20,April!$G$1:$CB$85,85,FALSE)","v":115},{"$f":"HLOOKUP(B20,May!$G$1:$CB$82,82,FALSE)","v":140},{"$f":"SUM(D20:M20)","v":1380}]
[15,"Fiachra Moynihan","What's Another Year",{"$f":"HLOOKUP(B21,August!$G$1:$CB$87,87,FALSE)","v":105},{"$f":"HLOOKUP(B21,September!$G$1:$CB$87,87,FALSE)","v":105},{"$f":"HLOOKUP(B21,October!$G$1:$CB$87,87,FALSE)","v":145},{"$f":"HLOOKUP(B21,November!$G$1:$CB$102,102,FALSE)","v":155},{"$f":"HLOOKUP(B21,December!$G$1:$CB$129,129,FALSE)","v":245},{"$f":"HLOOKUP(B21,January!$G$1:$CB$71,71,FALSE)","v":105},{"$f":"HLOOKUP(B21,February!$G$1:$CB$73,73,FALSE)","v":100},{"$f":"HLOOKUP(B21,March!$G$1:$CB$70,70,FALSE)","v":155},{"$f":"HLOOKUP(B21,April!$G$1:$CB$85,85,FALSE)","v":140},{"$f":"HLOOKUP(B21,May!$G$1:$CB$82,82,FALSE)","v":120},{"$f":"SUM(D21:M21)","v":1375}]
[16,"Cillian Conway","Big Dick Dunne XI",{"$f":"HLOOKUP(B22,August!$G$1:$CB$87,87,FALSE)","v":90},{"$f":"HLOOKUP(B22,September!$G$1:$CB$87,87,FALSE)","v":145},{"$f":"HLOOKUP(B22,October!$G$1:$CB$87,87,FALSE)","v":120},{"$f":"HLOOKUP(B22,November!$G$1:$CB$102,102,FALSE)","v":145},{"$f":"HLOOKUP(B22,December!$G$1:$CB$129,129,FALSE)","v":210},{"$f":"HLOOKUP(B22,January!$G$1:$CB$71,71,FALSE)","v":120},{"$f":"HLOOKUP(B22,February!$G$1:$CB$73,73,FALSE)","v":110},{"$f":"HLOOKUP(B22,March!$G$1:$CB$70,70,FALSE)","v":115},{"$f":"HLOOKUP(B22,April!$G$1:$CB$85,85,FALSE)","v":175},{"$f":"HLOOKUP(B22,May!$G$1:$CB$82,82,FALSE)","v":140},{"$f":"SUM(D22:M22)","v":1370}]
[17,"Aidan Knight","Unaganaguna",{"$f":"HLOOKUP(B23,August!$G$1:$CB$87,87,FALSE)","v":90},{"$f":"HLOOKUP(B23,September!$G$1:$CB$87,87,FALSE)","v":120},{"$f":"HLOOKUP(B23,October!$G$1:$CB$87,87,FALSE)","v":105},{"$f":"HLOOKUP(B23,November!$G$1:$CB$102,102,FALSE)","v":185},{"$f":"HLOOKUP(B23,December!$G$1:$CB$129,129,FALSE)","v":230},{"$f":"HLOOKUP(B23,January!$G$1:$CB$71,71,FALSE)","v":140},{"$f":"HLOOKUP(B23,February!$G$1:$CB$73,73,FALSE)","v":125},{"$f":"HLOOKUP(B23,March!$G$1:$CB$70,70,FALSE)","v":130},{"$f":"HLOOKUP(B23,April!$G$1:$CB$85,85,FALSE)","v":110},{"$f":"HLOOKUP(B23,May!$G$1:$CB$82,82,FALSE)","v":130},{"$f":"SUM(D23:M23)","v":1365}]
[18,"Jonathan Fox","Lallanas In Pajamas",{"$f":"HLOOKUP(B24,August!$G$1:$CB$87,87,FALSE)","v":105},{"$f":"HLOOKUP(B24,September!$G$1:$CB$87,87,FALSE)","v":115},{"$f":"HLOOKUP(B24,October!$G$1:$CB$87,87,FALSE)","v":145},{"$f":"HLOOKUP(B24,November!$G$1:$CB$102,102,FALSE)","v":130},{"$f":"HLOOKUP(B24,December!$G$1:$CB$129,129,FALSE)","v":230},{"$f":"HLOOKUP(B24,January!$G$1:$CB$71,71,FALSE)","v":155},{"$f":"HLOOKUP(B24,February!$G$1:$CB$73,73,FALSE)","v":105},{"$f":"HLOOKUP(B24,March!$G$1:$CB$70,70,FALSE)","v":165},{"$f":"HLOOKUP(B24,April!$G$1:$CB$85,85,FALSE)","v":100},{"$f":"HLOOKUP(B24,May!$G$1:$CB$82,82,FALSE)","v":115},{"$f":"SUM(D24:M24)","v":1365}]
[19,"Simon Purdue","Game of Throw-Ins",{"$f":"HLOOKUP(B25,August!$G$1:$CB$87,87,FALSE)","v":110},{"$f":"HLOOKUP(B25,September!$G$1:$CB$87,87,FALSE)","v":85},{"$f":"HLOOKUP(B25,October!$G$1:$CB$87,87,FALSE)","v":130},{"$f":"HLOOKUP(B25,November!$G$1:$CB$102,102,FALSE)","v":125},{"$f":"HLOOKUP(B25,December!$G$1:$CB$129,129,FALSE)","v":240},{"$f":"HLOOKUP(B25,January!$G$1:$CB$71,71,FALSE)","v":105},{"$f":"HLOOKUP(B25,February!$G$1:$CB$73,73,FALSE)","v":145},{"$f":"HLOOKUP(B25,March!$G$1:$CB$70,70,FALSE)","v":150},{"$f":"HLOOKUP(B25,April!$G$1:$CB$85,85,FALSE)","v":150},{"$f":"HLOOKUP(B25,May!$G$1:$CB$82,82,FALSE)","v":120},{"$f":"SUM(D25:M25)","v":1360}]
[20,"Brian Mullen","Plumbers Mate",{"$f":"HLOOKUP(B26,August!$G$1:$CB$87,87,FALSE)","v":105},{"$f":"HLOOKUP(B26,September!$G$1:$CB$87,87,FALSE)","v":115},{"$f":"HLOOKUP(B26,October!$G$1:$CB$87,87,FALSE)","v":125},{"$f":"HLOOKUP(B26,November!$G$1:$CB$102,102,FALSE)","v":155},{"$f":"HLOOKUP(B26,December!$G$1:$CB$129,129,FALSE)","v":215},{"$f":"HLOOKUP(B26,January!$G$1:$CB$71,71,FALSE)","v":120},{"$f":"HLOOKUP(B26,February!$G$1:$CB$73,73,FALSE)","v":100},{"$f":"HLOOKUP(B26,March!$G$1:$CB$70,70,FALSE)","v":150},{"$f":"HLOOKUP(B26,April!$G$1:$CB$85,85,FALSE)","v":115},{"$f":"HLOOKUP(B26,May!$G$1:$CB$82,82,FALSE)","v":155},{"$f":"SUM(D26:M26)","v":1355}]
[21,"Kevin Philpott","Kevin van Philpott",{"$f":"HLOOKUP(B27,August!$G$1:$CB$87,87,FALSE)","v":80},{"$f":"HLOOKUP(B27,September!$G$1:$CB$87,87,FALSE)","v":110},{"$f":"HLOOKUP(B27,October!$G$1:$CB$87,87,FALSE)","v":110},{"$f":"HLOOKUP(B27,November!$G$1:$CB$102,102,FALSE)","v":185},{"$f":"HLOOKUP(B27,December!$G$1:$CB$129,129,FALSE)","v":220},{"$f":"HLOOKUP(B27,January!$G$1:$CB$71,71,FALSE)","v":135},{"$f":"HLOOKUP(B27,February!$G$1:$CB$73,73,FALSE)","v":120},{"$f":"HLOOKUP(B27,March!$G$1:$CB$70,70,FALSE)","v":150},{"$f":"HLOOKUP(B27,April!$G$1:$CB$85,85,FALSE)","v":110},{"$f":"HLOOKUP(B27,May!$G$1:$CB$82,82,FALSE)","v":135},{"$f":"SUM(D27:M27)","v":1355}]
[22,"Andy Dunne","AC Pozallo",{"$f":"HLOOKUP(B28,August!$G$1:$CB$87,87,FALSE)","v":110},{"$f":"HLOOKUP(B28,September!$G$1:$CB$87,87,FALSE)","v":90},{"$f":"HLOOKUP(B28,October!$G$1:$CB$87,87,FALSE)","v":145},{"$f":"HLOOKUP(B28,November!$G$1:$CB$102,102,FALSE)","v":125},{"$f":"HLOOKUP(B28,December!$G$1:$CB$129,129,FALSE)","v":205},{"$f":"HLOOKUP(B28,January!$G$1:$CB$71,71,FALSE)","v":120},{"$f":"HLOOKUP(B28,February!$G$1:$CB$73,73,FALSE)","v":115},{"$f":"HLOOKUP(B28,March!$G$1:$CB$70,70,FALSE)","v":140},{"$f":"HLOOKUP(B28,April!$G$1:$CB$85,85,FALSE)","v":145},{"$f":"HLOOKUP(B28,May!$G$1:$CB$82,82,FALSE)","v":150},{"$f":"SUM(D28:M28)","v":1345}]
[23,"Maria Jordan","Ria's Rovers",{"$f":"HLOOKUP(B29,August!$G$1:$CB$87,87,FALSE)","v":125},{"$f":"HLOOKUP(B29,September!$G$1:$CB$87,87,FALSE)","v":90},{"$f":"HLOOKUP(B29,October!$G$1:$CB$87,87,FALSE)","v":130},{"$f":"HLOOKUP(B29,November!$G$1:$CB$102,102,FALSE)","v":160},{"$f":"HLOOKUP(B29,December!$G$1:$CB$129,129,FALSE)","v":190},{"$f":"HLOOKUP(B29,January!$G$1:$CB$71,71,FALSE)","v":125},{"$f":"HLOOKUP(B29,February!$G$1:$CB$73,73,FALSE)","v":145},{"$f":"HLOOKUP(B29,March!$G$1:$CB$70,70,FALSE)","v":140},{"$f":"HLOOKUP(B29,April!$G$1:$CB$85,85,FALSE)","v":120},{"$f":"HLOOKUP(B29,May!$G$1:$CB$82,82,FALSE)","v":120},{"$f":"SUM(D29:M29)","v":1345}]
[24,"Richard Johnston","Let There Be No Panic",{"$f":"HLOOKUP(B30,August!$G$1:$CB$87,87,FALSE)","v":95},{"$f":"HLOOKUP(B30,September!$G$1:$CB$87,87,FALSE)","v":85},{"$f":"HLOOKUP(B30,October!$G$1:$CB$87,87,FALSE)","v":115},{"$f":"HLOOKUP(B30,November!$G$1:$CB$102,102,FALSE)","v":125},{"$f":"HLOOKUP(B30,December!$G$1:$CB$129,129,FALSE)","v":260},{"$f":"HLOOKUP(B30,January!$G$1:$CB$71,71,FALSE)","v":140},{"$f":"HLOOKUP(B30,February!$G$1:$CB$73,73,FALSE)","v":125},{"$f":"HLOOKUP(B30,March!$G$1:$CB$70,70,FALSE)","v":150},{"$f":"HLOOKUP(B30,April!$G$1:$CB$85,85,FALSE)","v":135},{"$f":"HLOOKUP(B30,May!$G$1:$CB$82,82,FALSE)","v":115},{"$f":"SUM(D30:M30)","v":1345}]
[25,"Sharon Behan","Holly's Heroes",{"$f":"HLOOKUP(B31,August!$G$1:$CB$87,87,FALSE)","v":110},{"$f":"HLOOKUP(B31,September!$G$1:$CB$87,87,FALSE)","v":135},{"$f":"HLOOKUP(B31,October!$G$1:$CB$87,87,FALSE)","v":110},{"$f":"HLOOKUP(B31,November!$G$1:$CB$102,102,FALSE)","v":155},{"$f":"HLOOKUP(B31,December!$G$1:$CB$129,129,FALSE)","v":245},{"$f":"HLOOKUP(B31,January!$G$1:$CB$71,71,FALSE)","v":95},{"$f":"HLOOKUP(B31,February!$G$1:$CB$73,73,FALSE)","v":125},{"$f":"HLOOKUP(B31,March!$G$1:$CB$70,70,FALSE)","v":145},{"$f":"HLOOKUP(B31,April!$G$1:$CB$85,85,FALSE)","v":115},{"$f":"HLOOKUP(B31,May!$G$1:$CB$82,82,FALSE)","v":95},{"$f":"SUM(D31:M31)","v":1330}]
[26,"Conor Horan","Ricky Lamb Legs",{"$f":"HLOOKUP(B32,August!$G$1:$CB$87,87,FALSE)","v":100},{"$f":"HLOOKUP(B32,September!$G$1:$CB$87,87,FALSE)","v":85},{"$f":"HLOOKUP(B32,October!$G$1:$CB$87,87,FALSE)","v":120},{"$f":"HLOOKUP(B32,November!$G$1:$CB$102,102,FALSE)","v":145},{"$f":"HLOOKUP(B32,December!$G$1:$CB$129,129,FALSE)","v":215},{"$f":"HLOOKUP(B32,January!$G$1:$CB$71,71,FALSE)","v":140},{"$f":"HLOOKUP(B32,February!$G$1:$CB$73,73,FALSE)","v":120},{"$f":"HLOOKUP(B32,March!$G$1:$CB$70,70,FALSE)","v":170},{"$f":"HLOOKUP(B32,April!$G$1:$CB$85,85,FALSE)","v":110},{"$f":"HLOOKUP(B32,May!$G$1:$CB$82,82,FALSE)","v":115},{"$f":"SUM(D32:M32)","v":1320}]
[27,"Joe Turner","While My Qatar Gently Weeps",{"$f":"HLOOKUP(B33,August!$G$1:$CB$87,87,FALSE)","v":105},{"$f":"HLOOKUP(B33,September!$G$1:$CB$87,87,FALSE)","v":115},{"$f":"HLOOKUP(B33,October!$G$1:$CB$87,87,FALSE)","v":115},{"$f":"HLOOKUP(B33,November!$G$1:$CB$102,102,FALSE)","v":95},{"$f":"HLOOKUP(B33,December!$G$1:$CB$129,129,FALSE)","v":205},{"$f":"HLOOKUP(B33,January!$G$1:$CB$71,71,FALSE)","v":135},{"$f":"HLOOKUP(B33,February!$G$1:$CB$73,73,FALSE)","v":135},{"$f":"HLOOKUP(B33,March!$G$1:$CB$70,70,FALSE)","v":125},{"$f":"HLOOKUP(B33,April!$G$1:$CB$85,85,FALSE)","v":160},{"$f":"HLOOKUP(B33,May!$G$1:$CB$82,82,FALSE)","v":130},{"$f":"SUM(D33:M33)","v":1320}]
[28,"Oisin O'Reilly","Battle Cruiser",{"$f":"HLOOKUP(B34,August!$G$1:$CB$87,87,FALSE)","v":95},{"$f":"HLOOKUP(B34,September!$G$1:$CB$87,87,FALSE)","v":115},{"$f":"HLOOKUP(B34,October!$G$1:$CB$87,87,FALSE)","v":100},{"$f":"HLOOKUP(B34,November!$G$1:$CB$102,102,FALSE)","v":150},{"$f":"HLOOKUP(B34,December!$G$1:$CB$129,129,FALSE)","v":225},{"$f":"HLOOKUP(B34,January!$G$1:$CB$71,71,FALSE)","v":140},{"$f":"HLOOKUP(B34,February!$G$1:$CB$73,73,FALSE)","v":110},{"$f":"HLOOKUP(B34,March!$G$1:$CB$70,70,FALSE)","v":155},{"$f":"HLOOKUP(B34,April!$G$1:$CB$85,85,FALSE)","v":115},{"$f":"HLOOKUP(B34,May!$G$1:$CB$82,82,FALSE)","v":115},{"$f":"SUM(D34:M34)","v":1320}]
[29,"Pat Jordan","Zac Attack",{"$f":"HLOOKUP(B35,August!$G$1:$CB$87,87,FALSE)","v":90},{"$f":"HLOOKUP(B35,September!$G$1:$CB$87,87,FALSE)","v":110},{"$f":"HLOOKUP(B35,October!$G$1:$CB$87,87,FALSE)","v":110},{"$f":"HLOOKUP(B35,November!$G$1:$CB$102,102,FALSE)","v":110},{"$f":"HLOOKUP(B35,December!$G$1:$CB$129,129,FALSE)","v":250},{"$f":"HLOOKUP(B35,January!$G$1:$CB$71,71,FALSE)","v":135},{"$f":"HLOOKUP(B35,February!$G$1:$CB$73,73,FALSE)","v":100},{"$f":"HLOOKUP(B35,March!$G$1:$CB$70,70,FALSE)","v":145},{"$f":"HLOOKUP(B35,April!$G$1:$CB$85,85,FALSE)","v":110},{"$f":"HLOOKUP(B35,May!$G$1:$CB$82,82,FALSE)","v":145},{"$f":"SUM(D35:M35)","v":1305}]
[30,"Konstantin Kulev","Benkovski Byala",{"$f":"HLOOKUP(B36,August!$G$1:$CB$87,87,FALSE)","v":95},{"$f":"HLOOKUP(B36,September!$G$1:$CB$87,87,FALSE)","v":115},{"$f":"HLOOKUP(B36,October!$G$1:$CB$87,87,FALSE)","v":125},{"$f":"HLOOKUP(B36,November!$G$1:$CB$102,102,FALSE)","v":185},{"$f":"HLOOKUP(B36,December!$G$1:$CB$129,129,FALSE)","v":200},{"$f":"HLOOKUP(B36,January!$G$1:$CB$71,71,FALSE)","v":140},{"$f":"HLOOKUP(B36,February!$G$1:$CB$73,73,FALSE)","v":105},{"$f":"HLOOKUP(B36,March!$G$1:$CB$70,70,FALSE)","v":115},{"$f":"HLOOKUP(B36,April!$G$1:$CB$85,85,FALSE)","v":110},{"$f":"HLOOKUP(B36,May!$G$1:$CB$82,82,FALSE)","v":110},{"$f":"SUM(D36:M36)","v":1300}]
[31,"Joe O'Hehir","Louis De First",{"$f":"HLOOKUP(B37,August!$G$1:$CB$87,87,FALSE)","v":90},{"$f":"HLOOKUP(B37,September!$G$1:$CB$87,87,FALSE)","v":105},{"$f":"HLOOKUP(B37,October!$G$1:$CB$87,87,FALSE)","v":135},{"$f":"HLOOKUP(B37,November!$G$1:$CB$102,102,FALSE)","v":115},{"$f":"HLOOKUP(B37,December!$G$1:$CB$129,129,FALSE)","v":245},{"$f":"HLOOKUP(B37,January!$G$1:$CB$71,71,FALSE)","v":100},{"$f":"HLOOKUP(B37,February!$G$1:$CB$73,73,FALSE)","v":95},{"$f":"HLOOKUP(B37,March!$G$1:$CB$70,70,FALSE)","v":165},{"$f":"HLOOKUP(B37,April!$G$1:$CB$85,85,FALSE)","v":120},{"$f":"HLOOKUP(B37,May!$G$1:$CB$82,82,FALSE)","v":120},{"$f":"SUM(D37:M37)","v":1290}]
[32,"Mike Hall","Azpilicueta We Call Him Dave",{"$f":"HLOOKUP(B38,August!$G$1:$CB$87,87,FALSE)","v":115},{"$f":"HLOOKUP(B38,September!$G$1:$CB$87,87,FALSE)","v":135},{"$f":"HLOOKUP(B38,October!$G$1:$CB$87,87,FALSE)","v":105},{"$f":"HLOOKUP(B38,November!$G$1:$CB$102,102,FALSE)","v":155},{"$f":"HLOOKUP(B38,December!$G$1:$CB$129,129,FALSE)","v":215},{"$f":"HLOOKUP(B38,January!$G$1:$CB$71,71,FALSE)","v":115},{"$f":"HLOOKUP(B38,February!$G$1:$CB$73,73,FALSE)","v":115},{"$f":"HLOOKUP(B38,March!$G$1:$CB$70,70,FALSE)","v":130},{"$f":"HLOOKUP(B38,April!$G$1:$CB$85,85,FALSE)","v":105},{"$f":"HLOOKUP(B38,May!$G$1:$CB$82,82,FALSE)","v":100},{"$f":"SUM(D38:M38)","v":1290}]
[33,"Anthony Hughes","Tekkerslovakia",{"$f":"HLOOKUP(B39,August!$G$1:$CB$87,87,FALSE)","v":130},{"$f":"HLOOKUP(B39,September!$G$1:$CB$87,87,FALSE)","v":110},{"$f":"HLOOKUP(B39,October!$G$1:$CB$87,87,FALSE)","v":70},{"$f":"HLOOKUP(B39,November!$G$1:$CB$102,102,FALSE)","v":175},{"$f":"HLOOKUP(B39,December!$G$1:$CB$129,129,FALSE)","v":215},{"$f":"HLOOKUP(B39,January!$G$1:$CB$71,71,FALSE)","v":135},{"$f":"HLOOKUP(B39,February!$G$1:$CB$73,73,FALSE)","v":90},{"$f":"HLOOKUP(B39,March!$G$1:$CB$70,70,FALSE)","v":145},{"$f":"HLOOKUP(B39,April!$G$1:$CB$85,85,FALSE)","v":120},{"$f":"HLOOKUP(B39,May!$G$1:$CB$82,82,FALSE)","v":95},{"$f":"SUM(D39:M39)","v":1285}]
[34,"Gary McGurk","Barksdale's Crew",{"$f":"HLOOKUP(B40,August!$G$1:$CB$87,87,FALSE)","v":100},{"$f":"HLOOKUP(B40,September!$G$1:$CB$87,87,FALSE)","v":110},{"$f":"HLOOKUP(B40,October!$G$1:$CB$87,87,FALSE)","v":130},{"$f":"HLOOKUP(B40,November!$G$1:$CB$102,102,FALSE)","v":135},{"$f":"HLOOKUP(B40,December!$G$1:$CB$129,129,FALSE)","v":215},{"$f":"HLOOKUP(B40,January!$G$1:$CB$71,71,FALSE)","v":135},{"$f":"HLOOKUP(B40,February!$G$1:$CB$73,73,FALSE)","v":110},{"$f":"HLOOKUP(B40,March!$G$1:$CB$70,70,FALSE)","v":115},{"$f":"HLOOKUP(B40,April!$G$1:$CB$85,85,FALSE)","v":120},{"$f":"HLOOKUP(B40,May!$G$1:$CB$82,82,FALSE)","v":115},{"$f":"SUM(D40:M40)","v":1285}]
[35,"Aidan White","Lambert's Puppet Theatre",{"$f":"HLOOKUP(B41,August!$G$1:$CB$87,87,FALSE)","v":105},{"$f":"HLOOKUP(B41,September!$G$1:$CB$87,87,FALSE)","v":130},{"$f":"HLOOKUP(B41,October!$G$1:$CB$87,87,FALSE)","v":90},{"$f":"HLOOKUP(B41,November!$G$1:$CB$102,102,FALSE)","v":145},{"$f":"HLOOKUP(B41,December!$G$1:$CB$129,129,FALSE)","v":190},{"$f":"HLOOKUP(B41,January!$G$1:$CB$71,71,FALSE)","v":150},{"$f":"HLOOKUP(B41,February!$G$1:$CB$73,73,FALSE)","v":105},{"$f":"HLOOKUP(B41,March!$G$1:$CB$70,70,FALSE)","v":155},{"$f":"HLOOKUP(B41,April!$G$1:$CB$85,85,FALSE)","v":115},{"$f":"HLOOKUP(B41,May!$G$1:$CB$82,82,FALSE)","v":95},{"$f":"SUM(D41:M41)","v":1280}]
[36,"Kevin Donohoe","LTFC",{"$f":"HLOOKUP(B42,August!$G$1:$CB$87,87,FALSE)","v":115},{"$f":"HLOOKUP(B42,September!$G$1:$CB$87,87,FALSE)","v":130},{"$f":"HLOOKUP(B42,October!$G$1:$CB$87,87,FALSE)","v":95},{"$f":"HLOOKUP(B42,November!$G$1:$CB$102,102,FALSE)","v":135},{"$f":"HLOOKUP(B42,December!$G$1:$CB$129,129,FALSE)","v":240},{"$f":"HLOOKUP(B42,January!$G$1:$CB$71,71,FALSE)","v":135},{"$f":"HLOOKUP(B42,February!$G$1:$CB$73,73,FALSE)","v":145},{"$f":"HLOOKUP(B42,March!$G$1:$CB$70,70,FALSE)","v":135},{"$f":"HLOOKUP(B42,April!$G$1:$CB$85,85,FALSE)","v":100},{"$f":"HLOOKUP(B42,May!$G$1:$CB$82,82,FALSE)","v":50},{"$f":"SUM(D42:M42)","v":1280}]
[37,"Paul Moore","\"We Go To Norwich\"",{"$f":"HLOOKUP(B43,August!$G$1:$CB$87,87,FALSE)","v":100},{"$f":"HLOOKUP(B43,September!$G$1:$CB$87,87,FALSE)","v":105},{"$f":"HLOOKUP(B43,October!$G$1:$CB$87,87,FALSE)","v":130},{"$f":"HLOOKUP(B43,November!$G$1:$CB$102,102,FALSE)","v":140},{"$f":"HLOOKUP(B43,December!$G$1:$CB$129,129,FALSE)","v":210},{"$f":"HLOOKUP(B43,January!$G$1:$CB$71,71,FALSE)","v":135},{"$f":"HLOOKUP(B43,February!$G$1:$CB$73,73,FALSE)","v":120},{"$f":"HLOOKUP(B43,March!$G$1:$CB$70,70,FALSE)","v":115},{"$f":"HLOOKUP(B43,April!$G$1:$CB$85,85,FALSE)","v":115},{"$f":"HLOOKUP(B43,May!$G$1:$CB$82,82,FALSE)","v":105},{"$f":"SUM(D43:M43)","v":1275}]
[38,"Gerry Moore","Gunning For Title",{"$f":"HLOOKUP(B44,August!$G$1:$CB$87,87,FALSE)","v":115},{"$f":"HLOOKUP(B44,September!$G$1:$CB$87,87,FALSE)","v":105},{"$f":"HLOOKUP(B44,October!$G$1:$CB$87,87,FALSE)","v":110},{"$f":"HLOOKUP(B44,November!$G$1:$CB$102,102,FALSE)","v":110},{"$f":"HLOOKUP(B44,December!$G$1:$CB$129,129,FALSE)","v":215},{"$f":"HLOOKUP(B44,January!$G$1:$CB$71,71,FALSE)","v":135},{"$f":"HLOOKUP(B44,February!$G$1:$CB$73,73,FALSE)","v":140},{"$f":"HLOOKUP(B44,March!$G$1:$CB$70,70,FALSE)","v":100},{"$f":"HLOOKUP(B44,April!$G$1:$CB$85,85,FALSE)","v":135},{"$f":"HLOOKUP(B44,May!$G$1:$CB$82,82,FALSE)","v":105},{"$f":"SUM(D44:M44)","v":1270}]
[39,"Gareth Pierpoint","Balotellitubbies",{"$f":"HLOOKUP(B45,August!$G$1:$CB$87,87,FALSE)","v":105},{"$f":"HLOOKUP(B45,September!$G$1:$CB$87,87,FALSE)","v":100},{"$f":"HLOOKUP(B45,October!$G$1:$CB$87,87,FALSE)","v":105},{"$f":"HLOOKUP(B45,November!$G$1:$CB$102,102,FALSE)","v":120},{"$f":"HLOOKUP(B45,December!$G$1:$CB$129,129,FALSE)","v":235},{"$f":"HLOOKUP(B45,January!$G$1:$CB$71,71,FALSE)","v":130},{"$f":"HLOOKUP(B45,February!$G$1:$CB$73,73,FALSE)","v":110},{"$f":"HLOOKUP(B45,March!$G$1:$CB$70,70,FALSE)","v":130},{"$f":"HLOOKUP(B45,April!$G$1:$CB$85,85,FALSE)","v":120},{"$f":"HLOOKUP(B45,May!$G$1:$CB$82,82,FALSE)","v":110},{"$f":"SUM(D45:M45)","v":1265}]
[40,"Kris Stainton","Van Gaal's Galore",{"$f":"HLOOKUP(B46,August!$G$1:$CB$87,87,FALSE)","v":95},{"$f":"HLOOKUP(B46,September!$G$1:$CB$87,87,FALSE)","v":135},{"$f":"HLOOKUP(B46,October!$G$1:$CB$87,87,FALSE)","v":100},{"$f":"HLOOKUP(B46,November!$G$1:$CB$102,102,FALSE)","v":160},{"$f":"HLOOKUP(B46,December!$G$1:$CB$129,129,FALSE)","v":190},{"$f":"HLOOKUP(B46,January!$G$1:$CB$71,71,FALSE)","v":130},{"$f":"HLOOKUP(B46,February!$G$1:$CB$73,73,FALSE)","v":95},{"$f":"HLOOKUP(B46,March!$G$1:$CB$70,70,FALSE)","v":155},{"$f":"HLOOKUP(B46,April!$G$1:$CB$85,85,FALSE)","v":120},{"$f":"HLOOKUP(B46,May!$G$1:$CB$82,82,FALSE)","v":85},{"$f":"SUM(D46:M46)","v":1265}]
[41,"Siobhan Murphy","Kopout",{"$f":"HLOOKUP(B47,August!$G$1:$CB$87,87,FALSE)","v":100},{"$f":"HLOOKUP(B47,September!$G$1:$CB$87,87,FALSE)","v":90},{"$f":"HLOOKUP(B47,October!$G$1:$CB$87,87,FALSE)","v":135},{"$f":"HLOOKUP(B47,November!$G$1:$CB$102,102,FALSE)","v":135},{"$f":"HLOOKUP(B47,December!$G$1:$CB$129,129,FALSE)","v":245},{"$f":"HLOOKUP(B47,January!$G$1:$CB$71,71,FALSE)","v":110},{"$f":"HLOOKUP(B47,February!$G$1:$CB$73,73,FALSE)","v":95},{"$f":"HLOOKUP(B47,March!$G$1:$CB$70,70,FALSE)","v":135},{"$f":"HLOOKUP(B47,April!$G$1:$CB$85,85,FALSE)","v":120},{"$f":"HLOOKUP(B47,May!$G$1:$CB$82,82,FALSE)","v":100},{"$f":"SUM(D47:M47)","v":1265}]
[42,"Aiden Desch","Yid Army",{"$f":"HLOOKUP(B48,August!$G$1:$CB$87,87,FALSE)","v":95},{"$f":"HLOOKUP(B48,September!$G$1:$CB$87,87,FALSE)","v":100},{"$f":"HLOOKUP(B48,October!$G$1:$CB$87,87,FALSE)","v":105},{"$f":"HLOOKUP(B48,November!$G$1:$CB$102,102,FALSE)","v":165},{"$f":"HLOOKUP(B48,December!$G$1:$CB$129,129,FALSE)","v":205},{"$f":"HLOOKUP(B48,January!$G$1:$CB$71,71,FALSE)","v":90},{"$f":"HLOOKUP(B48,February!$G$1:$CB$73,73,FALSE)","v":115},{"$f":"HLOOKUP(B48,March!$G$1:$CB$70,70,FALSE)","v":135},{"$f":"HLOOKUP(B48,April!$G$1:$CB$85,85,FALSE)","v":155},{"$f":"HLOOKUP(B48,May!$G$1:$CB$82,82,FALSE)","v":95},{"$f":"SUM(D48:M48)","v":1260}]
[43,"Brendan Maguire","Back on Top",{"$f":"HLOOKUP(B49,August!$G$1:$CB$87,87,FALSE)","v":95},{"$f":"HLOOKUP(B49,September!$G$1:$CB$87,87,FALSE)","v":110},{"$f":"HLOOKUP(B49,October!$G$1:$CB$87,87,FALSE)","v":105},{"$f":"HLOOKUP(B49,November!$G$1:$CB$102,102,FALSE)","v":145},{"$f":"HLOOKUP(B49,December!$G$1:$CB$129,129,FALSE)","v":200},{"$f":"HLOOKUP(B49,January!$G$1:$CB$71,71,FALSE)","v":90},{"$f":"HLOOKUP(B49,February!$G$1:$CB$73,73,FALSE)","v":115},{"$f":"HLOOKUP(B49,March!$G$1:$CB$70,70,FALSE)","v":150},{"$f":"HLOOKUP(B49,April!$G$1:$CB$85,85,FALSE)","v":125},{"$f":"HLOOKUP(B49,May!$G$1:$CB$82,82,FALSE)","v":125},{"$f":"SUM(D49:M49)","v":1260}]
[44,"David Cooney","Ranaghan City",{"$f":"HLOOKUP(B50,August!$G$1:$CB$87,87,FALSE)","v":130},{"$f":"HLOOKUP(B50,September!$G$1:$CB$87,87,FALSE)","v":95},{"$f":"HLOOKUP(B50,October!$G$1:$CB$87,87,FALSE)","v":105},{"$f":"HLOOKUP(B50,November!$G$1:$CB$102,102,FALSE)","v":130},{"$f":"HLOOKUP(B50,December!$G$1:$CB$129,129,FALSE)","v":245},{"$f":"HLOOKUP(B50,January!$G$1:$CB$71,71,FALSE)","v":120},{"$f":"HLOOKUP(B50,February!$G$1:$CB$73,73,FALSE)","v":85},{"$f":"HLOOKUP(B50,March!$G$1:$CB$70,70,FALSE)","v":120},{"$f":"HLOOKUP(B50,April!$G$1:$CB$85,85,FALSE)","v":115},{"$f":"HLOOKUP(B50,May!$G$1:$CB$82,82,FALSE)","v":110},{"$f":"SUM(D50:M50)","v":1255}]
[45,"David Keavney","YaJokinArnYa",{"$f":"HLOOKUP(B51,August!$G$1:$CB$87,87,FALSE)","v":110},{"$f":"HLOOKUP(B51,September!$G$1:$CB$87,87,FALSE)","v":115},{"$f":"HLOOKUP(B51,October!$G$1:$CB$87,87,FALSE)","v":95},{"$f":"HLOOKUP(B51,November!$G$1:$CB$102,102,FALSE)","v":120},{"$f":"HLOOKUP(B51,December!$G$1:$CB$129,129,FALSE)","v":220},{"$f":"HLOOKUP(B51,January!$G$1:$CB$71,71,FALSE)","v":130},{"$f":"HLOOKUP(B51,February!$G$1:$CB$73,73,FALSE)","v":95},{"$f":"HLOOKUP(B51,March!$G$1:$CB$70,70,FALSE)","v":165},{"$f":"HLOOKUP(B51,April!$G$1:$CB$85,85,FALSE)","v":115},{"$f":"HLOOKUP(B51,May!$G$1:$CB$82,82,FALSE)","v":85},{"$f":"SUM(D51:M51)","v":1250}]
[46,"Philip Jordan","Vale 46",{"$f":"HLOOKUP(B52,August!$G$1:$CB$87,87,FALSE)","v":105},{"$f":"HLOOKUP(B52,September!$G$1:$CB$87,87,FALSE)","v":125},{"$f":"HLOOKUP(B52,October!$G$1:$CB$87,87,FALSE)","v":120},{"$f":"HLOOKUP(B52,November!$G$1:$CB$102,102,FALSE)","v":120},{"$f":"HLOOKUP(B52,December!$G$1:$CB$129,129,FALSE)","v":245},{"$f":"HLOOKUP(B52,January!$G$1:$CB$71,71,FALSE)","v":105},{"$f":"HLOOKUP(B52,February!$G$1:$CB$73,73,FALSE)","v":85},{"$f":"HLOOKUP(B52,March!$G$1:$CB$70,70,FALSE)","v":140},{"$f":"HLOOKUP(B52,April!$G$1:$CB$85,85,FALSE)","v":115},{"$f":"HLOOKUP(B52,May!$G$1:$CB$82,82,FALSE)","v":90},{"$f":"SUM(D52:M52)","v":1250}]
[47,"Wayne Donovan","Thy Kingdom Come",{"$f":"HLOOKUP(B53,August!$G$1:$CB$87,87,FALSE)","v":130},{"$f":"HLOOKUP(B53,September!$G$1:$CB$87,87,FALSE)","v":120},{"$f":"HLOOKUP(B53,October!$G$1:$CB$87,87,FALSE)","v":100},{"$f":"HLOOKUP(B53,November!$G$1:$CB$102,102,FALSE)","v":135},{"$f":"HLOOKUP(B53,December!$G$1:$CB$129,129,FALSE)","v":225},{"$f":"HLOOKUP(B53,January!$G$1:$CB$71,71,FALSE)","v":120},{"$f":"HLOOKUP(B53,February!$G$1:$CB$73,73,FALSE)","v":95},{"$f":"HLOOKUP(B53,March!$G$1:$CB$70,70,FALSE)","v":135},{"$f":"HLOOKUP(B53,April!$G$1:$CB$85,85,FALSE)","v":115},{"$f":"HLOOKUP(B53,May!$G$1:$CB$82,82,FALSE)","v":75},{"$f":"SUM(D53:M53)","v":1250}]
[48,"Ciaran O'Hart","Riverchapel Plate",{"$f":"HLOOKUP(B54,August!$G$1:$CB$87,87,FALSE)","v":95},{"$f":"HLOOKUP(B54,September!$G$1:$CB$87,87,FALSE)","v":100},{"$f":"HLOOKUP(B54,October!$G$1:$CB$87,87,FALSE)","v":115},{"$f":"HLOOKUP(B54,November!$G$1:$CB$102,102,FALSE)","v":155},{"$f":"HLOOKUP(B54,December!$G$1:$CB$129,129,FALSE)","v":205},{"$f":"HLOOKUP(B54,January!$G$1:$CB$71,71,FALSE)","v":115},{"$f":"HLOOKUP(B54,February!$G$1:$CB$73,73,FALSE)","v":115},{"$f":"HLOOKUP(B54,March!$G$1:$CB$70,70,FALSE)","v":140},{"$f":"HLOOKUP(B54,April!$G$1:$CB$85,85,FALSE)","v":100},{"$f":"HLOOKUP(B54,May!$G$1:$CB$82,82,FALSE)","v":95},{"$f":"SUM(D54:M54)","v":1235}]
[49,"Shane Horan","ShaneyHoransFC",{"$f":"HLOOKUP(B55,August!$G$1:$CB$87,87,FALSE)","v":100},{"$f":"HLOOKUP(B55,September!$G$1:$CB$87,87,FALSE)","v":90},{"$f":"HLOOKUP(B55,October!$G$1:$CB$87,87,FALSE)","v":95},{"$f":"HLOOKUP(B55,November!$G$1:$CB$102,102,FALSE)","v":145},{"$f":"HLOOKUP(B55,December!$G$1:$CB$129,129,FALSE)","v":200},{"$f":"HLOOKUP(B55,January!$G$1:$CB$71,71,FALSE)","v":105},{"$f":"HLOOKUP(B55,February!$G$1:$CB$73,73,FALSE)","v":145},{"$f":"HLOOKUP(B55,March!$G$1:$CB$70,70,FALSE)","v":160},{"$f":"HLOOKUP(B55,April!$G$1:$CB$85,85,FALSE)","v":145},{"$f":"HLOOKUP(B55,May!$G$1:$CB$82,82,FALSE)","v":50},{"$f":"SUM(D55:M55)","v":1235}]
[50,"Phil Doyle","FC Muertos Vivientes Goteo de Snr Z",{"$f":"HLOOKUP(B56,August!$G$1:$CB$87,87,FALSE)","v":90},{"$f":"HLOOKUP(B56,September!$G$1:$CB$87,87,FALSE)","v":90},{"$f":"HLOOKUP(B56,October!$G$1:$CB$87,87,FALSE)","v":65},{"$f":"HLOOKUP(B56,November!$G$1:$CB$102,102,FALSE)","v":180},{"$f":"HLOOKUP(B56,December!$G$1:$CB$129,129,FALSE)","v":245},{"$f":"HLOOKUP(B56,January!$G$1:$CB$71,71,FALSE)","v":120},{"$f":"HLOOKUP(B56,February!$G$1:$CB$73,73,FALSE)","v":90},{"$f":"HLOOKUP(B56,March!$G$1:$CB$70,70,FALSE)","v":145},{"$f":"HLOOKUP(B56,April!$G$1:$CB$85,85,FALSE)","v":120},{"$f":"HLOOKUP(B56,May!$G$1:$CB$82,82,FALSE)","v":85},{"$f":"SUM(D56:M56)","v":1230}]
[51,"Liam Butler","Happy Hammers",{"$f":"HLOOKUP(B57,August!$G$1:$CB$87,87,FALSE)","v":90},{"$f":"HLOOKUP(B57,September!$G$1:$CB$87,87,FALSE)","v":90},{"$f":"HLOOKUP(B57,October!$G$1:$CB$87,87,FALSE)","v":90},{"$f":"HLOOKUP(B57,November!$G$1:$CB$102,102,FALSE)","v":145},{"$f":"HLOOKUP(B57,December!$G$1:$CB$129,129,FALSE)","v":230},{"$f":"HLOOKUP(B57,January!$G$1:$CB$71,71,FALSE)","v":105},{"$f":"HLOOKUP(B57,February!$G$1:$CB$73,73,FALSE)","v":105},{"$f":"HLOOKUP(B57,March!$G$1:$CB$70,70,FALSE)","v":150},{"$f":"HLOOKUP(B57,April!$G$1:$CB$85,85,FALSE)","v":120},{"$f":"HLOOKUP(B57,May!$G$1:$CB$82,82,FALSE)","v":100},{"$f":"SUM(D57:M57)","v":1225}]
[52,"Sean O'Mairtin","Creweless",{"$f":"HLOOKUP(B58,August!$G$1:$CB$87,87,FALSE)","v":70},{"$f":"HLOOKUP(B58,September!$G$1:$CB$87,87,FALSE)","v":95},{"$f":"HLOOKUP(B58,October!$G$1:$CB$87,87,FALSE)","v":105},{"$f":"HLOOKUP(B58,November!$G$1:$CB$102,102,FALSE)","v":105},{"$f":"HLOOKUP(B58,December!$G$1:$CB$129,129,FALSE)","v":210},{"$f":"HLOOKUP(B58,January!$G$1:$CB$71,71,FALSE)","v":155},{"$f":"HLOOKUP(B58,February!$G$1:$CB$73,73,FALSE)","v":120},{"$f":"HLOOKUP(B58,March!$G$1:$CB$70,70,FALSE)","v":120},{"$f":"HLOOKUP(B58,April!$G$1:$CB$85,85,FALSE)","v":105},{"$f":"HLOOKUP(B58,May!$G$1:$CB$82,82,FALSE)","v":130},{"$f":"SUM(D58:M58)","v":1215}]
[53,"Craig Calvert","Red Van Man",{"$f":"HLOOKUP(B59,August!$G$1:$CB$87,87,FALSE)","v":75},{"$f":"HLOOKUP(B59,September!$G$1:$CB$87,87,FALSE)","v":115},{"$f":"HLOOKUP(B59,October!$G$1:$CB$87,87,FALSE)","v":100},{"$f":"HLOOKUP(B59,November!$G$1:$CB$102,102,FALSE)","v":115},{"$f":"HLOOKUP(B59,December!$G$1:$CB$129,129,FALSE)","v":245},{"$f":"HLOOKUP(B59,January!$G$1:$CB$71,71,FALSE)","v":100},{"$f":"HLOOKUP(B59,February!$G$1:$CB$73,73,FALSE)","v":115},{"$f":"HLOOKUP(B59,March!$G$1:$CB$70,70,FALSE)","v":145},{"$f":"HLOOKUP(B59,April!$G$1:$CB$85,85,FALSE)","v":100},{"$f":"HLOOKUP(B59,May!$G$1:$CB$82,82,FALSE)","v":100},{"$f":"SUM(D59:M59)","v":1210}]
[54,"Dave Green","Hope It's This Year",{"$f":"HLOOKUP(B60,August!$G$1:$CB$87,87,FALSE)","v":110},{"$f":"HLOOKUP(B60,September!$G$1:$CB$87,87,FALSE)","v":115},{"$f":"HLOOKUP(B60,October!$G$1:$CB$87,87,FALSE)","v":70},{"$f":"HLOOKUP(B60,November!$G$1:$CB$102,102,FALSE)","v":120},{"$f":"HLOOKUP(B60,December!$G$1:$CB$129,129,FALSE)","v":230},{"$f":"HLOOKUP(B60,January!$G$1:$CB$71,71,FALSE)","v":110},{"$f":"HLOOKUP(B60,February!$G$1:$CB$73,73,FALSE)","v":130},{"$f":"HLOOKUP(B60,March!$G$1:$CB$70,70,FALSE)","v":120},{"$f":"HLOOKUP(B60,April!$G$1:$CB$85,85,FALSE)","v":105},{"$f":"HLOOKUP(B60,May!$G$1:$CB$82,82,FALSE)","v":90},{"$f":"SUM(D60:M60)","v":1200}]
[55,"Joe Behan","Melchester Rovers",{"$f":"HLOOKUP(B61,August!$G$1:$CB$87,87,FALSE)","v":115},{"$f":"HLOOKUP(B61,September!$G$1:$CB$87,87,FALSE)","v":105},{"$f":"HLOOKUP(B61,October!$G$1:$CB$87,87,FALSE)","v":105},{"$f":"HLOOKUP(B61,November!$G$1:$CB$102,102,FALSE)","v":120},{"$f":"HLOOKUP(B61,December!$G$1:$CB$129,129,FALSE)","v":180},{"$f":"HLOOKUP(B61,January!$G$1:$CB$71,71,FALSE)","v":125},{"$f":"HLOOKUP(B61,February!$G$1:$CB$73,73,FALSE)","v":110},{"$f":"HLOOKUP(B61,March!$G$1:$CB$70,70,FALSE)","v":110},{"$f":"HLOOKUP(B61,April!$G$1:$CB$85,85,FALSE)","v":105},{"$f":"HLOOKUP(B61,May!$G$1:$CB$82,82,FALSE)","v":120},{"$f":"SUM(D61:M61)","v":1195}]
[56,"Niall Carroll","Baker's Corner",{"$f":"HLOOKUP(B62,August!$G$1:$CB$87,87,FALSE)","v":90},{"$f":"HLOOKUP(B62,September!$G$1:$CB$87,87,FALSE)","v":120},{"$f":"HLOOKUP(B62,October!$G$1:$CB$87,87,FALSE)","v":100},{"$f":"HLOOKUP(B62,November!$G$1:$CB$102,102,FALSE)","v":100},{"$f":"HLOOKUP(B62,December!$G$1:$CB$129,129,FALSE)","v":215},{"$f":"HLOOKUP(B62,January!$G$1:$CB$71,71,FALSE)","v":115},{"$f":"HLOOKUP(B62,February!$G$1:$CB$73,73,FALSE)","v":100},{"$f":"HLOOKUP(B62,March!$G$1:$CB$70,70,FALSE)","v":110},{"$f":"HLOOKUP(B62,April!$G$1:$CB$85,85,FALSE)","v":120},{"$f":"HLOOKUP(B62,May!$G$1:$CB$82,82,FALSE)","v":105},{"$f":"SUM(D62:M62)","v":1175}]
[57,"Liam Geraghty","All Aboard Jose's Big Blue Bus",{"$f":"HLOOKUP(B63,August!$G$1:$CB$87,87,FALSE)","v":95},{"$f":"HLOOKUP(B63,September!$G$1:$CB$87,87,FALSE)","v":110},{"$f":"HLOOKUP(B63,October!$G$1:$CB$87,87,FALSE)","v":100},{"$f":"HLOOKUP(B63,November!$G$1:$CB$102,102,FALSE)","v":125},{"$f":"HLOOKUP(B63,December!$G$1:$CB$129,129,FALSE)","v":170},{"$f":"HLOOKUP(B63,January!$G$1:$CB$71,71,FALSE)","v":145},{"$f":"HLOOKUP(B63,February!$G$1:$CB$73,73,FALSE)","v":100},{"$f":"HLOOKUP(B63,March!$G$1:$CB$70,70,FALSE)","v":150},{"$f":"HLOOKUP(B63,April!$G$1:$CB$85,85,FALSE)","v":75},{"$f":"HLOOKUP(B63,May!$G$1:$CB$82,82,FALSE)","v":90},{"$f":"SUM(D63:M63)","v":1160}]
[58,"Aidan Scanlon","Kilflynn Santos",{"$f":"HLOOKUP(B64,August!$G$1:$CB$87,87,FALSE)","v":80},{"$f":"HLOOKUP(B64,September!$G$1:$CB$87,87,FALSE)","v":120},{"$f":"HLOOKUP(B64,October!$G$1:$CB$87,87,FALSE)","v":105},{"$f":"HLOOKUP(B64,November!$G$1:$CB$102,102,FALSE)","v":150},{"$f":"HLOOKUP(B64,December!$G$1:$CB$129,129,FALSE)","v":185},{"$f":"HLOOKUP(B64,January!$G$1:$CB$71,71,FALSE)","v":110},{"$f":"HLOOKUP(B64,February!$G$1:$CB$73,73,FALSE)","v":80},{"$f":"HLOOKUP(B64,March!$G$1:$CB$70,70,FALSE)","v":105},{"$f":"HLOOKUP(B64,April!$G$1:$CB$85,85,FALSE)","v":115},{"$f":"HLOOKUP(B64,May!$G$1:$CB$82,82,FALSE)","v":100},{"$f":"SUM(D64:M64)","v":1150}]
[59,"Alan Boyle","What For Ref?",{"$f":"HLOOKUP(B65,August!$G$1:$CB$87,87,FALSE)","v":115},{"$f":"HLOOKUP(B65,September!$G$1:$CB$87,87,FALSE)","v":95},{"$f":"HLOOKUP(B65,October!$G$1:$CB$87,87,FALSE)","v":145},{"$f":"HLOOKUP(B65,November!$G$1:$CB$102,102,FALSE)","v":155},{"$f":"HLOOKUP(B65,December!$G$1:$CB$129,129,FALSE)","v":175},{"$f":"HLOOKUP(B65,January!$G$1:$CB$71,71,FALSE)","v":145},{"$f":"HLOOKUP(B65,February!$G$1:$CB$73,73,FALSE)","v":105},{"$f":"HLOOKUP(B65,March!$G$1:$CB$70,70,FALSE)","v":160},{"$f":"HLOOKUP(B65,April!$G$1:$CB$85,85,FALSE)","v":50},{"$f":"HLOOKUP(B65,May!$G$1:$CB$82,82,FALSE)","v":5},{"$f":"SUM(D65:M65)","v":1150}]
[60,"Chris Hall","Kangaroo Court",{"$f":"HLOOKUP(B66,August!$G$1:$CB$87,87,FALSE)","v":95},{"$f":"HLOOKUP(B66,September!$G$1:$CB$87,87,FALSE)","v":75},{"$f":"HLOOKUP(B66,October!$G$1:$CB$87,87,FALSE)","v":100},{"$f":"HLOOKUP(B66,November!$G$1:$CB$102,102,FALSE)","v":120},{"$f":"HLOOKUP(B66,December!$G$1:$CB$129,129,FALSE)","v":205},{"$f":"HLOOKUP(B66,January!$G$1:$CB$71,71,FALSE)","v":120},{"$f":"HLOOKUP(B66,February!$G$1:$CB$73,73,FALSE)","v":75},{"$f":"HLOOKUP(B66,March!$G$1:$CB$70,70,FALSE)","v":110},{"$f":"HLOOKUP(B66,April!$G$1:$CB$85,85,FALSE)","v":105},{"$f":"HLOOKUP(B66,May!$G$1:$CB$82,82,FALSE)","v":115},{"$f":"SUM(D66:M66)","v":1120}]
[61,"Javier Suarez Barreiro","Tiki Taka",{"$f":"HLOOKUP(B67,August!$G$1:$CB$87,87,FALSE)","v":115},{"$f":"HLOOKUP(B67,September!$G$1:$CB$87,87,FALSE)","v":80},{"$f":"HLOOKUP(B67,October!$G$1:$CB$87,87,FALSE)","v":95},{"$f":"HLOOKUP(B67,November!$G$1:$CB$102,102,FALSE)","v":130},{"$f":"HLOOKUP(B67,December!$G$1:$CB$129,129,FALSE)","v":225},{"$f":"HLOOKUP(B67,January!$G$1:$CB$71,71,FALSE)","v":130},{"$f":"HLOOKUP(B67,February!$G$1:$CB$73,73,FALSE)","v":120},{"$f":"HLOOKUP(B67,March!$G$1:$CB$70,70,FALSE)","v":130},{"$f":"HLOOKUP(B67,April!$G$1:$CB$85,85,FALSE)","v":40},{"$f":"HLOOKUP(B67,May!$G$1:$CB$82,82,FALSE)","v":15},{"$f":"SUM(D67:M67)","v":1080}]
[62,"Rhona Devlin","LFC Rhoz",{"$f":"HLOOKUP(B68,August!$G$1:$CB$87,87,FALSE)","v":130},{"$f":"HLOOKUP(B68,September!$G$1:$CB$87,87,FALSE)","v":80},{"$f":"HLOOKUP(B68,October!$G$1:$CB$87,87,FALSE)","v":65},{"$f":"HLOOKUP(B68,November!$G$1:$CB$102,102,FALSE)","v":115},{"$f":"HLOOKUP(B68,December!$G$1:$CB$129,129,FALSE)","v":125},{"$f":"HLOOKUP(B68,January!$G$1:$CB$71,71,FALSE)","v":105},{"$f":"HLOOKUP(B68,February!$G$1:$CB$73,73,FALSE)","v":110},{"$f":"HLOOKUP(B68,March!$G$1:$CB$70,70,FALSE)","v":110},{"$f":"HLOOKUP(B68,April!$G$1:$CB$85,85,FALSE)","v":75},{"$f":"HLOOKUP(B68,May!$G$1:$CB$82,82,FALSE)","v":75},{"$f":"SUM(D68:M68)","v":990}]
[63,"Terry Behan","Utd4Ever",{"$f":"HLOOKUP(B69,August!$G$1:$CB$87,87,FALSE)","v":100},{"$f":"HLOOKUP(B69,September!$G$1:$CB$87,87,FALSE)","v":95},{"$f":"HLOOKUP(B69,October!$G$1:$CB$87,87,FALSE)","v":95},{"$f":"HLOOKUP(B69,November!$G$1:$CB$102,102,FALSE)","v":140},{"$f":"HLOOKUP(B69,December!$G$1:$CB$129,129,FALSE)","v":200},{"$f":"HLOOKUP(B69,January!$G$1:$CB$71,71,FALSE)","v":115},{"$f":"HLOOKUP(B69,February!$G$1:$CB$73,73,FALSE)","v":120},{"$f":"HLOOKUP(B69,March!$G$1:$CB$70,70,FALSE)","v":100},{"$f":"HLOOKUP(B69,April!$G$1:$CB$85,85,FALSE)","v":5},{"$f":"HLOOKUP(B69,May!$G$1:$CB$82,82,FALSE)","v":10},{"$f":"SUM(D69:M69)","v":980}]
[64,"Tom McHugh","Crystal Pulis",{"$f":"HLOOKUP(B70,August!$G$1:$CB$87,87,FALSE)","v":110},{"$f":"HLOOKUP(B70,September!$G$1:$CB$87,87,FALSE)","v":110},{"$f":"HLOOKUP(B70,October!$G$1:$CB$87,87,FALSE)","v":105},{"$f":"HLOOKUP(B70,November!$G$1:$CB$102,102,FALSE)","v":100},{"$f":"HLOOKUP(B70,December!$G$1:$CB$129,129,FALSE)","v":240},{"$f":"HLOOKUP(B70,January!$G$1:$CB$71,71,FALSE)","v":90},{"$f":"HLOOKUP(B70,February!$G$1:$CB$73,73,FALSE)","v":75},{"$f":"HLOOKUP(B70,March!$G$1:$CB$70,70,FALSE)","v":20},{"$f":"HLOOKUP(B70,April!$G$1:$CB$85,85,FALSE)","v":0},{"$f":"HLOOKUP(B70,May!$G$1:$CB$82,82,FALSE)","v":5},{"$f":"SUM(D70:M70)","v":855}]
[65,"Ray Ellis","Hodge Ball FC",{"$f":"HLOOKUP(B71,August!$G$1:$CB$87,87,FALSE)","v":95},{"$f":"HLOOKUP(B71,September!$G$1:$CB$87,87,FALSE)","v":95},{"$f":"HLOOKUP(B71,October!$G$1:$CB$87,87,FALSE)","v":115},{"$f":"HLOOKUP(B71,November!$G$1:$CB$102,102,FALSE)","v":130},{"$f":"HLOOKUP(B71,December!$G$1:$CB$129,129,FALSE)","v":120},{"$f":"HLOOKUP(B71,January!$G$1:$CB$71,71,FALSE)","v":115},{"$f":"HLOOKUP(B71,February!$G$1:$CB$73,73,FALSE)","v":75},{"$f":"HLOOKUP(B71,March!$G$1:$CB$70,70,FALSE)","v":65},{"$f":"HLOOKUP(B71,April!$G$1:$CB$85,85,FALSE)","v":0},{"$f":"HLOOKUP(B71,May!$G$1:$CB$82,82,FALSE)","v":5},{"$f":"SUM(D71:M71)","v":815}]
[66,"Aaron Byrne","Crash n Byrne",{"$f":"HLOOKUP(B72,August!$G$1:$CB$87,87,FALSE)","v":80},{"$f":"HLOOKUP(B72,September!$G$1:$CB$87,87,FALSE)","v":95},{"$f":"HLOOKUP(B72,October!$G$1:$CB$87,87,FALSE)","v":140},{"$f":"HLOOKUP(B72,November!$G$1:$CB$102,102,FALSE)","v":145},{"$f":"HLOOKUP(B72,December!$G$1:$CB$129,129,FALSE)","v":215},{"$f":"HLOOKUP(B72,January!$G$1:$CB$71,71,FALSE)","v":100},{"$f":"HLOOKUP(B72,February!$G$1:$CB$73,73,FALSE)","v":10},{"$f":"HLOOKUP(B72,March!$G$1:$CB$70,70,FALSE)","v":15},{"$f":"HLOOKUP(B72,April!$G$1:$CB$85,85,FALSE)","v":0},{"$f":"HLOOKUP(B72,May!$G$1:$CB$82,82,FALSE)","v":10},{"$f":"SUM(D72:M72)","v":810}]
[67,"Keith Horan","Death By Football",{"$f":"HLOOKUP(B73,August!$G$1:$CB$87,87,FALSE)","v":105},{"$f":"HLOOKUP(B73,September!$G$1:$CB$87,87,FALSE)","v":115},{"$f":"HLOOKUP(B73,October!$G$1:$CB$87,87,FALSE)","v":105},{"$f":"HLOOKUP(B73,November!$G$1:$CB$102,102,FALSE)","v":150},{"$f":"HLOOKUP(B73,December!$G$1:$CB$129,129,FALSE)","v":195},{"$f":"HLOOKUP(B73,January!$G$1:$CB$71,71,FALSE)","v":60},{"$f":"HLOOKUP(B73,February!$G$1:$CB$73,73,FALSE)","v":10},{"$f":"HLOOKUP(B73,March!$G$1:$CB$70,70,FALSE)","v":45},{"$f":"HLOOKUP(B73,April!$G$1:$CB$85,85,FALSE)","v":5},{"$f":"HLOOKUP(B73,May!$G$1:$CB$82,82,FALSE)","v":5},{"$f":"SUM(D73:M73)","v":795}]
[68,"David Byrne","In Parry I Trust",{"$f":"HLOOKUP(B74,August!$G$1:$CB$87,87,FALSE)","v":115},{"$f":"HLOOKUP(B74,September!$G$1:$CB$87,87,FALSE)","v":85},{"$f":"HLOOKUP(B74,October!$G$1:$CB$87,87,FALSE)","v":115},{"$f":"HLOOKUP(B74,November!$G$1:$CB$102,102,FALSE)","v":125},{"$f":"HLOOKUP(B74,December!$G$1:$CB$129,129,FALSE)","v":135},{"$f":"HLOOKUP(B74,January!$G$1:$CB$71,71,FALSE)","v":155},{"$f":"HLOOKUP(B74,February!$G$1:$CB$73,73,FALSE)","v":5},{"$f":"HLOOKUP(B74,March!$G$1:$CB$70,70,FALSE)","v":20},{"$f":"HLOOKUP(B74,April!$G$1:$CB$85,85,FALSE)","v":5},{"$f":"HLOOKUP(B74,May!$G$1:$CB$82,82,FALSE)","v":15},{"$f":"SUM(D74:M74)","v":775}]
[69,"Peter Behan","FC Nerazzuri",{"$f":"HLOOKUP(B75,August!$G$1:$CB$87,87,FALSE)","v":100},{"$f":"HLOOKUP(B75,September!$G$1:$CB$87,87,FALSE)","v":85},{"$f":"HLOOKUP(B75,October!$G$1:$CB$87,87,FALSE)","v":110},{"$f":"HLOOKUP(B75,November!$G$1:$CB$102,102,FALSE)","v":165},{"$f":"HLOOKUP(B75,December!$G$1:$CB$129,129,FALSE)","v":200},{"$f":"HLOOKUP(B75,January!$G$1:$CB$71,71,FALSE)","v":20},{"$f":"HLOOKUP(B75,February!$G$1:$CB$73,73,FALSE)","v":10},{"$f":"HLOOKUP(B75,March!$G$1:$CB$70,70,FALSE)","v":20},{"$f":"HLOOKUP(B75,April!$G$1:$CB$85,85,FALSE)","v":10},{"$f":"HLOOKUP(B75,May!$G$1:$CB$82,82,FALSE)","v":10},{"$f":"SUM(D75:M75)","v":730}]
[70,"Tiago Moreira","Moriera United",{"$f":"HLOOKUP(B76,August!$G$1:$CB$87,87,FALSE)","v":105},{"$f":"HLOOKUP(B76,September!$G$1:$CB$87,87,FALSE)","v":145},{"$f":"HLOOKUP(B76,October!$G$1:$CB$87,87,FALSE)","v":100},{"$f":"HLOOKUP(B76,November!$G$1:$CB$102,102,FALSE)","v":55},{"$f":"HLOOKUP(B76,December!$G$1:$CB$129,129,FALSE)","v":70},{"$f":"HLOOKUP(B76,January!$G$1:$CB$71,71,FALSE)","v":70},{"$f":"HLOOKUP(B76,February!$G$1:$CB$73,73,FALSE)","v":60},{"$f":"HLOOKUP(B76,March!$G$1:$CB$70,70,FALSE)","v":70},{"$f":"HLOOKUP(B76,April!$G$1:$CB$85,85,FALSE)","v":15},{"$f":"HLOOKUP(B76,May!$G$1:$CB$82,82,FALSE)","v":25},{"$f":"SUM(D76:M76)","v":715}]
[71,"Paul Stainton","Don't Slip Stevie",{"$f":"HLOOKUP(B77,August!$G$1:$CB$87,87,FALSE)","v":105},{"$f":"HLOOKUP(B77,September!$G$1:$CB$87,87,FALSE)","v":65},{"$f":"HLOOKUP(B77,October!$G$1:$CB$87,87,FALSE)","v":135},{"$f":"HLOOKUP(B77,November!$G$1:$CB$102,102,FALSE)","v":175},{"$f":"HLOOKUP(B77,December!$G$1:$CB$129,129,FALSE)","v":90},{"$f":"HLOOKUP(B77,January!$G$1:$CB$71,71,FALSE)","v":50},{"$f":"HLOOKUP(B77,February!$G$1:$CB$73,73,FALSE)","v":40},{"$f":"HLOOKUP(B77,March!$G$1:$CB$70,70,FALSE)","v":20},{"$f":"HLOOKUP(B77,April!$G$1:$CB$85,85,FALSE)","v":10},{"$f":"HLOOKUP(B77,May!$G$1:$CB$82,82,FALSE)","v":10},{"$f":"SUM(D77:M77)","v":700}]
[72,"Ian Healy","Foffyz Fuzz",{"$f":"HLOOKUP(B78,August!$G$1:$CB$87,87,FALSE)","v":85},{"$f":"HLOOKUP(B78,September!$G$1:$CB$87,87,FALSE)","v":100},{"$f":"HLOOKUP(B78,October!$G$1:$CB$87,87,FALSE)","v":140},{"$f":"HLOOKUP(B78,November!$G$1:$CB$102,102,FALSE)","v":100},{"$f":"HLOOKUP(B78,December!$G$1:$CB$129,129,FALSE)","v":20},{"$f":"HLOOKUP(B78,January!$G$1:$CB$71,71,FALSE)","v":25},{"$f":"HLOOKUP(B78,February!$G$1:$CB$73,73,FALSE)","v":15},{"$f":"HLOOKUP(B78,March!$G$1:$CB$70,70,FALSE)","v":20},{"$f":"HLOOKUP(B78,April!$G$1:$CB$85,85,FALSE)","v":20},{"$f":"HLOOKUP(B78,May!$G$1:$CB$82,82,FALSE)","v":30},{"$f":"SUM(D78:M78)","v":555}]
[73,"Jenny Ellis","Ellis Eleven",{"$f":"HLOOKUP(B79,August!$G$1:$CB$87,87,FALSE)","v":95},{"$f":"HLOOKUP(B79,September!$G$1:$CB$87,87,FALSE)","v":90},{"$f":"HLOOKUP(B79,October!$G$1:$CB$87,87,FALSE)","v":120},{"$f":"HLOOKUP(B79,November!$G$1:$CB$102,102,FALSE)","v":135},{"$f":"HLOOKUP(B79,December!$G$1:$CB$129,129,FALSE)","v":55},{"$f":"HLOOKUP(B79,January!$G$1:$CB$71,71,FALSE)","v":15},{"$f":"HLOOKUP(B79,February!$G$1:$CB$73,73,FALSE)","v":10},{"$f":"HLOOKUP(B79,March!$G$1:$CB$70,70,FALSE)","v":10},{"$f":"HLOOKUP(B79,April!$G$1:$CB$85,85,FALSE)","v":5},{"$f":"HLOOKUP(B79,May!$G$1:$CB$82,82,FALSE)","v":10},{"$f":"SUM(D79:M79)","v":545}]
[74,"Sean Moloney","66/1 Outsider",{"$f":"HLOOKUP(B80,August!$G$1:$CB$87,87,FALSE)","v":90},{"$f":"HLOOKUP(B80,September!$G$1:$CB$87,87,FALSE)","v":70},{"$f":"HLOOKUP(B80,October!$G$1:$CB$87,87,FALSE)","v":75},{"$f":"HLOOKUP(B80,November!$G$1:$CB$102,102,FALSE)","v":55},{"$f":"HLOOKUP(B80,December!$G$1:$CB$129,129,FALSE)","v":15},{"$f":"HLOOKUP(B80,January!$G$1:$CB$71,71,FALSE)","v":5},{"$f":"HLOOKUP(B80,February!$G$1:$CB$73,73,FALSE)","v":10},{"$f":"HLOOKUP(B80,March!$G$1:$CB$70,70,FALSE)","v":15},{"$f":"HLOOKUP(B80,April!$G$1:$CB$85,85,FALSE)","v":5},{"$f":"HLOOKUP(B80,May!$G$1:$CB$82,82,FALSE)","v":0},{"$f":"SUM(D80:M80)","v":340}]

{"sheet":"August","index":1,"n_rows":89,"n_cols":80,"rows_kept":89,"cut":false,"hidden":false,"merged":[[33,0,33,4],[42,0,42,4],[30,0,30,4],[1,0,1,4],[10,0,10,4],[14,0,14,4],[17,0,17,4],[25,0,25,4]]}
[null,null,null,null,null,null,"Aaron Byrne","Aidan Knight","Aidan Scanlon","Aidan White","Aiden Desch","Alan Boyle","Anastas Popov","Andy Dunne","Anthony Hughes","Barry Healy","Brendan Maguire","Brian Mullen","Brian Prendergast","Brian Sotolongo","Chris Hall","Ciaran O'Hart","Cillian Conway","Colin McAnaspie","Con McSweeney","Conor Horan","Craig Calvert","Dave Green","Dave McGinley","David Bone","David Byrne","David Cooney","David Keavney","Eamon Fox","Fiachra Moynihan","Gareth Pierpoint","Gary McGurk","Gavin Morgan","Gerry Draper","Gerry Moore","Ian Healy","Javier Suarez Barreiro","Jenny Ellis","Joe Behan","Joe O'Hehir","Joe Turner","Jonathan Fox","Keith Horan","Kevin Donohoe","Kevin Philpott","Konstantin Kulev","Kris Stainton","Liam Butler","Liam Geraghty","Maria Jordan","Mike Hall","Niall Carroll","Oisin O'Reilly","Padraic Carney","Pat Jordan","Paul Moore","Paul Prendergast","Paul Stainton","Peter Behan","Phil Doyle","Philip Jordan","Ralph Goodwin","Ray Ellis","Rhona Devlin","Richard Johnston","Sean Moloney","Sean O'Mairtin","Shane Horan","Sharon Behan","Simon Purdue","Siobhan Murphy","Terry Behan","Tiago Moreira","Tom McHugh","Wayne Donovan"]
["Saturday, August 16th"]
["Man United",1,2,"Swansea City","12:45:00",null,0,0,0,0,0,0,0,0,0,0,0,0,0,0,0,0,0,0,0,0,0,0,0,0,0,0,0,0,0,0,0,0,0,0,0,0,0,0,0,0,0,0,0,0,0,0,0,0,0,0,0,0,0,0,0,0,0,0,0,0,0,0,0,0,0,0,0,0,0,0,0,0,0,0]
["Leicester City",2,2,"Everton","15:00:00",null,0,0,0,0,0,5,5,0,0,0,5,0,5,0,0,5,5,0,5,0,0,0,0,5,5,5,0,5,10,0,0,0,0,0,0,0,5,0,0,10,0,0,5,0,0,0,5,0,5,5,0,0,5,0,0,5,0,0,0,0,0,0,0,0,0,0,10,0,0,5,5,0,0,5]
["QPR",0,1,"Hull City","15:00:00",null,0,0,0,0,0,0,0,0,0,0,0,0,0,5,0,0,0,0,0,0,0,0,0,5,0,0,0,0,0,0,0,0,0,0,0,0,0,0,0,0,0,0,0,0,0,0,0,5,0,0,0,0,0,0,0,0,0,0,0,0,5,0,10,0,0,0,0,0,0,0,5,0,0,0]
["Stoke City",0,1,"Aston Villa","15:00:00",null,0,0,0,0,0,0,0,0,5,0,0,0,0,0,0,0,0,0,0,0,0,0,0,0,0,0,0,0,0,0,0,0,0,0,0,0,0,0,0,0,0,0,0,0,0,0,0,0,5,0,0,0,0,0,0,0,0,0,0,0,0,0,0,0,0,0,10,0,0,0,0,0,0,0]
["West Brom",2,2,"Sunderland","15:00:00",null,0,0,0,5,5,0,5,5,5,5,5,5,5,5,0,0,0,5,5,5,0,5,5,0,5,5,0,0,10,10,5,0,10,5,0,5,0,0,0,5,0,0,0,5,5,0,0,0,0,5,10,0,5,0,5,0,0,0,0,5,0,0,0,0,0,10,0,5,5,0,5,0,0,5]
["West Ham",0,1,"Tottenham","15:00:00",null,0,0,5,5,5,5,0,5,5,5,0,5,0,0,10,5,5,5,5,5,5,0,0,5,0,0,0,5,5,0,5,5,5,5,5,5,5,5,5,0,10,0,0,5,5,5,0,0,0,5,5,5,0,5,0,0,5,5,5,5,10,5,0,5,5,0,5,5,5,5,5,5,5,0]
["Arsenal",2,1,"Crystal Palace","17:30:00",null,5,5,5,5,5,5,5,5,5,5,5,5,5,5,5,5,5,5,5,5,5,5,5,5,5,5,5,5,5,5,5,5,5,5,5,5,5,5,5,5,5,5,5,5,5,5,5,5,10,5,5,5,5,5,5,5,5,5,5,5,5,5,5,5,5,5,5,5,5,5,5,5,5,5]
[]
["Sunday, August 17th"]
["Liverpool",2,1,"Southampton","13:30:00",null,5,5,0,10,5,5,5,5,5,5,5,5,5,10,5,5,5,5,5,5,10,5,5,5,5,5,5,5,5,5,5,5,5,5,5,5,10,5,5,5,5,5,5,5,5,0,5,5,10,10,5,10,5,5,5,5,10,5,10,10,5,10,5,5,5,5,5,5,5,0,5,10,5,5]
["Newcastle United",0,2,"Man City","16:00:00",null,5,5,0,5,10,5,5,10,5,5,10,5,5,10,5,0,5,10,10,5,5,5,5,5,5,10,0,0,5,5,5,5,5,5,5,5,5,5,10,5,5,0,10,5,10,5,10,5,10,5,0,5,5,5,5,5,5,10,5,5,10,5,10,5,0,0,0,5,5,10,5,5,0,5]
[]
["Monday, August 18th"]
["Burnley",1,3,"Chelsea","20:00:00",null,5,5,5,5,5,5,5,5,10,5,5,5,5,5,5,5,5,5,5,5,5,10,5,5,10,5,5,5,5,5,5,5,5,5,5,10,10,10,5,5,5,5,5,5,5,5,5,5,5,5,5,5,5,5,5,5,10,5,5,10,5,5,5,5,5,5,5,5,10,10,5,5,10,5]
[]
["Saturday, August 23rd"]
["Aston Villa",0,0,"Newcastle","12:45:00",null,0,5,0,5,5,0,0,5,5,0,5,0,0,5,5,10,5,0,5,0,5,5,5,0,0,0,5,5,5,0,0,0,0,0,0,5,0,5,0,0,0,5,5,5,0,0,0,0,0,10,0,0,0,0,5,5,0,5,0,5,0,0,0,0,5,0,0,5,5,5,0,0,5,0]
["Chelsea",2,0,"Leicester City","15:00:00",null,5,5,5,5,10,5,5,5,5,5,10,5,5,5,5,10,5,10,5,5,5,5,5,5,5,5,5,10,5,5,5,5,5,5,5,5,5,10,5,5,5,5,10,5,10,10,5,5,5,5,5,5,5,5,5,5,5,5,10,5,5,5,5,5,5,5,10,10,5,10,5,10,5,5]
["Crystal Palace",1,3,"West Ham","15:00:00",null,5,0,5,0,0,0,0,0,0,0,0,0,0,0,0,0,5,0,0,0,0,5,0,0,0,0,0,0,0,0,0,0,5,0,0,5,0,0,5,0,0,0,0,5,0,0,5,0,0,0,0,0,0,0,0,0,5,0,5,5,0,0,5,0,5,0,0,0,0,5,0,0,0,0]
["Southampton",0,0,"West Brom","15:00:00",null,5,0,0,0,0,0,0,0,0,0,0,0,0,0,0,0,0,0,0,0,0,0,0,0,0,0,0,0,0,0,0,0,5,0,0,0,0,5,0,0,0,0,0,0,0,0,5,0,0,0,0,0,0,0,0,0,0,0,5,0,0,0,10,5,0,0,0,0,0,0,0,0,0,0]
["Swansea City",1,0,"Burnley","15:00:00",null,5,5,5,0,0,5,5,5,5,10,5,5,5,10,10,10,5,10,5,5,5,5,10,10,10,5,10,10,5,5,5,5,10,5,0,5,5,5,5,5,10,5,5,5,5,0,5,5,10,5,5,5,5,5,0,5,5,5,5,0,5,0,10,5,5,5,5,5,5,10,5,5,5,5]
["Everton",2,2,"Arsenal","17:30:00",null,0,5,0,10,0,5,5,5,5,5,5,0,5,0,10,5,5,0,5,0,0,10,5,0,5,5,0,5,5,10,0,0,10,10,0,0,10,0,0,0,0,5,5,0,5,0,0,0,5,5,5,0,5,0,10,5,10,0,0,0,0,5,10,10,5,5,0,0,5,0,10,5,10,5]
[]
["Sunday, August 24th"]
["Hull City",1,1,"Stoke City","13:30:00",null,10,0,10,10,10,10,0,0,10,10,0,5,0,0,0,0,0,5,10,0,0,0,10,10,0,5,0,10,0,0,5,10,0,5,0,0,0,0,0,10,0,5,0,10,0,0,0,0,0,0,10,0,5,0,10,10,0,5,10,0,0,0,0,0,10,10,0,10,10,0,10,5,0,10]
["Tottenham",4,0,"QPR","13:30:00",null,5,5,5,5,5,5,5,5,5,5,5,5,5,5,5,5,5,5,5,5,5,5,5,5,0,5,5,5,5,5,5,5,5,5,5,0,5,5,0,5,5,5,5,5,5,5,0,5,5,5,5,5,5,5,5,5,5,5,5,5,5,5,5,5,5,5,5,5,5,5,5,5,0,5]
["Sunderland",1,1,"Man United","16:00:00",null,0,0,0,0,0,0,0,10,0,0,0,0,10,10,0,0,0,0,0,0,0,0,0,5,0,5,10,0,0,0,0,0,0,10,0,5,5,10,0,0,0,10,0,0,0,0,0,0,0,0,0,0,10,0,0,0,0,0,0,0,0,0,10,0,10,0,0,10,0,0,0,0,10,10]
[]
["Monday, August 25th"]
["Man City",3,1,"Liverpool","20:00:00",null,0,5,5,0,5,10,5,0,5,5,5,10,5,5,5,5,0,0,5,0,5,5,5,5,0,5,5,5,0,5,0,5,5,10,0,5,5,5,5,0,5,0,0,0,5,5,0,5,0,5,0,10,5,5,0,0,5,10,5,10,0,5,0,0,0,5,0,5,5,5,5,5,0,5]
[]
["Saturday, August 30th"]
["Burnley",0,0,"Man United","12:45:00",null,0,0,0,0,0,0,0,0,0,0,0,0,5,0,0,0,0,0,0,0,0,0,0,0,0,5,0,0,0,0,0,0,5,0,0,5,0,0,0,0,0,5,0,0,0,0,0,5,0,0,0,0,0,0,0,0,0,0,0,0,0,0,0,0,0,0,0,0,0,0,0,5,0,5]
["Man City",0,1,"Stoke City","15:00:00",null,0,0,0,0,0,0,0,0,0,0,0,0,0,0,0,0,0,0,0,0,0,0,0,0,0,0,0,0,0,0,0,0,0,0,0,0,0,0,0,0,0,0,0,0,0,0,0,0,0,0,0,0,0,0,0,0,0,0,0,0,0,0,0,0,0,0,0,0,0,0,0,0,0,0]
["Newcastle",3,3,"Crystal Palace","15:00:00",null,5,0,0,0,0,0,0,0,5,0,0,0,5,0,5,0,0,0,0,0,0,0,0,0,0,0,0,0,0,0,0,0,0,0,0,0,0,0,0,0,0,0,0,0,0,5,0,0,5,5,0,0,5,0,0,5,0,0,0,0,0,0,5,0,0,0,0,5,0,0,5,5,0,0]
["QPR",1,0,"Sunderland","15:00:00",null,0,0,0,0,10,5,5,0,0,0,0,10,0,5,5,10,0,5,0,5,0,0,0,0,10,0,10,0,0,0,0,0,5,0,5,0,0,0,0,0,10,0,5,0,0,0,10,0,10,0,10,0,0,0,0,0,5,0,0,5,10,5,0,5,0,0,0,0,0,0,0,0,0,0]
["Swansea City",3,0,"West Brom","15:00:00",null,5,5,5,5,0,0,5,0,5,5,5,5,5,5,0,0,5,5,5,5,5,5,5,0,5,5,5,5,5,5,5,5,5,5,5,5,5,5,5,5,5,5,5,5,5,5,0,5,5,5,5,5,5,5,5,5,5,5,0,0,5,5,5,5,5,5,5,5,5,5,5,0,5,5]
["West Ham",1,3,"Southampton","15:00:00",null,0,0,0,0,0,0,0,0,0,5,0,0,0,0,0,0,0,0,0,5,0,0,0,5,5,0,0,0,5,0,0,0,0,0,0,5,0,0,0,0,0,0,0,0,0,5,0,0,5,0,0,0,0,0,0,0,0,0,0,0,0,0,0,0,0,0,5,0,0,0,0,0,0,0]
["Everton",3,6,"Chelsea","17:30:00",null,5,5,5,5,0,5,5,5,5,5,0,5,5,5,5,0,0,0,0,5,5,5,0,5,5,5,5,5,5,5,5,5,5,5,0,0,5,5,5,0,5,5,5,5,0,0,0,5,5,5,5,5,5,5,5,5,5,5,5,5,0,5,0,0,0,0,0,5,5,5,5,0,5,5]
[]
["Sunday, August 31st"]
["Aston Villa",2,1,"Hull City","13:30:00",null,5,5,10,0,0,10,0,10,0,5,5,10,5,0,5,5,5,10,5,0,0,5,0,0,5,10,0,5,5,5,0,5,5,5,5,5,5,0,10,10,5,5,5,0,10,10,5,0,5,0,0,0,10,5,0,10,5,5,0,0,5,5,5,5,0,0,5,0,5,5,0,0,10,0]
["Tottenham",0,3,"Liverpool","13:30:00",null,0,0,0,0,0,0,0,5,5,0,0,0,0,0,0,0,0,5,0,5,0,0,0,5,5,0,0,0,0,5,5,0,0,0,0,5,0,5,5,0,0,0,0,0,0,0,0,0,5,0,0,0,0,5,5,5,0,5,0,0,5,5,5,5,0,0,5,5,0,0,0,0,5,0]
["Leicester City",1,1,"Arsenal","16:00:00",null,0,0,0,0,0,0,0,0,0,0,0,0,0,0,0,0,0,0,0,0,0,0,0,0,0,10,10,0,0,0,0,0,0,0,0,0,0,0,0,0,0,0,10,0,0,0,0,10,0,0,0,0,10,0,0,0,0,0,0,0,0,0,0,0,0,0,0,0,0,0,0,5,0,10]
[]
["Golden Boots"]
["Alexis Sanchez - Arsenal",null,null,null,{"$f":"0+0+1","v":1},{"$f":"COUNT(G49:CB49)","v":14},null,{"$f":"5*$E49","v":5},null,null,null,null,null,{"$f":"5*$E49","v":5},null,null,null,null,null,{"$f":"5*$E49","v":5},null,null,null,null,{"$f":"5*$E49","v":5},{"$f":"5*$E49","v":5},null,null,{"$f":"5*$E49","v":5},null,null,null,null,null,null,null,null,null,null,null,null,null,{"$f":"5*$E49","v":5},null,{"$f":"5*$E49","v":5},null,null,null,null,null,null,{"$f":"5*$E49","v":5},null,null,null,null,null,{"$f":"5*$E49","v":5},null,null,null,null,{"$f":"5*$E49","v":5},{"$f":"5*$E49","v":5},null,null,null,null,null,null,null,null,null,{"$f":"5*$E49","v":5},null,null,null,{"$f":"5*$E49","v":5}]
["Daniel Sturridge - Liverpool",null,null,null,{"$f":"1+0+0","v":1},52,{"$f":"5*$E50","v":5},null,{"$f":"5*$E50","v":5},{"$f":"5*$E50","v":5},{"$f":"5*$E50","v":5},null,{"$f":"5*$E50","v":5},{"$f":"5*$E50","v":5},{"$f":"5*$E50","v":5},{"$f":"5*$E50","v":5},{"$f":"5*$E50","v":5},{"$f":"5*$E50","v":5},{"$f":"5*$E50","v":5},null,null,{"$f":"5*$E50","v":5},{"$f":"5*$E50","v":5},{"$f":"5*$E50","v":5},null,{"$f":"5*$E50","v":5},{"$f":"5*$E50","v":5},{"$f":"5*$E50","v":5},null,null,{"$f":"5*$E50","v":5},{"$f":"5*$E50","v":5},{"$f":"5*$E50","v":5},null,{"$f":"5*$E50","v":5},5,5,5,5,null,5,5,null,{"$f":"5*$E50","v":5},{"$f":"5*$E50","v":5},null,{"$f":"5*$E50","v":5},{"$f":"5*$E50","v":5},null,{"$f":"5*$E50","v":5},{"$f":"5*$E50","v":5},null,{"$f":"5*$E50","v":5},{"$f":"5*$E50","v":5},{"$f":"5*$E50","v":5},{"$f":"5*$E50","v":5},{"$f":"5*$E50","v":5},{"$f":"5*$E50","v":5},null,null,{"$f":"5*$E50","v":5},{"$f":"5*$E50","v":5},{"$f":"5*$E50","v":5},5,{"$f":"5*$E50","v":5},null,null,null,{"$f":"5*$E50","v":5},null,{"$f":"5*$E50","v":5},{"$f":"5*$E50","v":5},{"$f":"5*$E50","v":5},null,{"$f":"5*$E50","v":5},{"$f":"5*$E50","v":5},null,null,{"$f":"5*$E50","v":5},{"$f":"5*$E50","v":5}]
["Diego Costa - Chelsea",null,null,null,{"$f":"1+1+2","v":4},39,null,{"$f":"5*$E51","v":20},null,20,null,{"$f":"5*$E51","v":20},{"$f":"5*$E51","v":20},null,20,{"$f":"5*$E51","v":20},null,null,{"$f":"5*$E51","v":20},{"$f":"5*$E51","v":20},null,null,null,null,null,{"$f":"5*$E51","v":20},null,{"$f":"5*$E51","v":20},{"$f":"5*$E51","v":20},null,20,{"$f":"5*$E51","v":20},{"$f":"5*$E51","v":20},{"$f":"5*$E51","v":20},null,{"$f":"5*$E51","v":20},{"$f":"5*$E51","v":20},null,null,null,{"$f":"5*$E51","v":20},{"$f":"5*$E51","v":20},null,{"$f":"5*$E51","v":20},null,{"$f":"5*$E51","v":20},20,{"$f":"5*$E51","v":20},{"$f":"5*$E51","v":20},null,null,{"$f":"5*$E51","v":20},{"$f":"5*$E51","v":20},{"$f":"5*$E51","v":20},null,{"$f":"5*$E51","v":20},null,{"$f":"5*$E51","v":20},{"$f":"5*$E51","v":20},{"$f":"5*$E51","v":20},{"$f":"5*$E51","v":20},null,null,null,null,{"$f":"5*$E51","v":20},{"$f":"5*$E51","v":20},{"$f":"5*$E51","v":20},null,{"$f":"5*$E51","v":20},null,null,null,null,null,null,null,{"$f":"5*$E51","v":20},{"$f":"5*$E51","v":20},20]
["Eden Hazard - Chelsea",null,null,null,{"$f":"0+1+0","v":1},2,null,null,null,null,{"$f":"5*$E52","v":5},null,null,null,null,null,null,null,null,null,null,null,null,null,null,null,null,null,null,null,null,null,null,null,null,null,null,null,null,null,null,null,null,null,null,null,null,null,null,null,null,null,null,null,null,null,null,null,null,null,null,null,null,null,null,null,null,null,null,null,null,null,null,null,null,{"$f":"5*$E52","v":5}]
["Edin Dzeko - Man City",null,null,null,{"$f":"0+0+0","v":0},6,null,null,null,null,null,{"$f":"5*$E53","v":0},null,null,null,null,null,null,null,null,null,null,null,null,null,null,null,{"$f":"5*$E53","v":0},null,null,null,null,null,null,null,null,null,null,null,null,null,null,{"$f":"5*$E53","v":0},null,null,{"$f":"5*$E53","v":0},null,null,null,null,null,null,null,null,null,null,null,null,null,null,null,null,null,null,null,null,null,{"$f":"5*$E53","v":0},null,null,null,null,null,{"$f":"5*$E53","v":0}]
["Emmanuel Adebayor - Tottenham",null,null,null,{"$f":"0+1+0","v":1},3,null,null,null,null,null,null,null,null,null,null,null,null,null,null,{"$f":"5*$E54","v":5},null,null,null,null,null,null,null,null,null,null,null,null,null,null,null,null,null,null,{"$f":"5*$E54","v":5},null,null,null,null,null,null,null,null,null,null,null,null,null,null,null,null,null,null,null,null,null,null,null,null,null,null,null,null,null,null,{"$f":"5*$E54","v":5}]
["Olivier Giroud - Arsenal",null,null,null,{"$f":"0+1+0","v":1},4,null,null,null,null,null,{"$f":"5*$E55","v":5},null,null,null,null,null,null,null,null,null,null,null,null,null,null,null,null,null,{"$f":"5*$E55","v":5},null,null,null,null,null,null,null,null,null,{"$f":"5*$E55","v":5},null,null,null,null,null,null,null,{"$f":"5*$E55","v":5}]
["Raheem Sterling - Liverpool",null,null,null,{"$f":"1+0+1","v":2},3,null,null,null,null,null,null,null,null,null,null,null,null,null,null,null,null,null,null,null,null,null,null,null,null,null,null,null,null,null,null,null,null,null,null,null,null,null,null,null,{"$f":"5*$E56","v":10},null,null,null,null,null,null,null,null,null,null,null,null,null,null,null,null,null,null,null,null,null,null,{"$f":"5*$E56","v":10},null,null,null,{"$f":"5*$E56","v":10}]
["Robin van Persie - Man United",null,null,null,{"$f":"0+0+0","v":0},45,{"$f":"5*$E57","v":0},{"$f":"5*$E57","v":0},null,{"$f":"5*$E57","v":0},null,null,null,null,null,{"$f":"5*$E57","v":0},{"$f":"5*$E57","v":0},{"$f":"5*$E57","v":0},{"$f":"5*$E57","v":0},null,{"$f":"5*$E57","v":0},{"$f":"5*$E57","v":0},null,{"$f":"5*$E57","v":0},{"$f":"5*$E57","v":0},null,{"$f":"5*$E57","v":0},null,null,{"$f":"5*$E57","v":0},null,{"$f":"5*$E57","v":0},{"$f":"5*$E57","v":0},{"$f":"5*$E57","v":0},{"$f":"5*$E57","v":0},{"$f":"5*$E57","v":0},null,{"$f":"5*$E57","v":0},{"$f":"5*$E57","v":0},null,null,{"$f":"5*$E57","v":0},{"$f":"5*$E57","v":0},{"$f":"5*$E57","v":0},null,null,{"$f":"5*$E57","v":0},null,{"$f":"5*$E57","v":0},{"$f":"5*$E57","v":0},{"$f":"5*$E57","v":0},null,{"$f":"5*$E57","v":0},{"$f":"5*$E57","v":0},{"$f":"5*$E57","v":0},{"$f":"5*$E57","v":0},{"$f":"5*$E57","v":0},null,{"$f":"5*$E57","v":0},{"$f":"5*$E57","v":0},{"$f":"5*$E57","v":0},{"$f":"5*$E57","v":0},null,null,{"$f":"5*$E57","v":0},{"$f":"5*$E57","v":0},{"$f":"5*$E57","v":0},{"$f":"5*$E57","v":0},null,{"$f":"5*$E57","v":0},null,{"$f":"5*$E57","v":0},null,null,null,{"$f":"5*$E57","v":0},{"$f":"5*$E57","v":0},null,{"$f":"5*$E57","v":0}]
["Romelu Lukaku - Everton",null,null,null,{"$f":"0+0+0","v":0},7,{"$f":"5*$E58","v":0},null,{"$f":"5*$E58","v":0},null,null,null,null,null,null,null,null,null,null,{"$f":"5*$E58","v":0},{"$f":"5*$E58","v":0},null,null,null,null,null,null,null,null,null,null,null,null,null,null,null,null,null,null,null,null,null,null,null,null,null,null,null,null,{"$f":"5*$E58","v":0},null,null,null,null,null,null,null,null,null,null,null,null,null,null,null,null,null,null,null,null,null,null,null,null,null,null,{"$f":"5*$E58","v":0},{"$f":"5*$E58","v":0}]
["Sergio Aguero - Man City",null,null,null,{"$f":"1+1+0","v":2},21,null,null,null,null,null,null,{"$f":"5*$E59","v":10},{"$f":"5*$E59","v":10},null,null,{"$f":"5*$E59","v":10},{"$f":"5*$E59","v":10},null,null,null,null,{"$f":"5*$E59","v":10},{"$f":"5*$E59","v":10},{"$f":"5*$E59","v":10},null,null,null,{"$f":"5*$E59","v":10},{"$f":"5*$E59","v":10},null,null,null,null,{"$f":"5*$E59","v":10},null,{"$f":"5*$E59","v":10},{"$f":"5*$E59","v":10},{"$f":"5*$E59","v":10},{"$f":"5*$E59","v":10},{"$f":"5*$E59","v":10},null,null,null,null,null,null,null,null,null,{"$f":"5*$E59","v":10},null,null,null,{"$f":"5*$E59","v":10},null,null,null,{"$f":"5*$E59","v":10},null,null,{"$f":"5*$E59","v":10},null,null,null,null,{"$f":"5*$E59","v":10},null,null,null,null,null,null,null,{"$f":"5*$E59","v":10}]
["Steven Gerrard - Liverpool",null,null,null,{"$f":"0+0+1","v":1},1,null,null,null,null,null,null,null,null,null,null,null,null,null,null,null,null,null,null,null,null,null,null,null,null,null,null,null,null,null,null,null,null,null,null,null,null,null,null,null,null,null,null,null,null,null,null,null,null,null,null,null,null,null,null,null,null,null,null,null,null,null,null,{"$f":"5*$E60","v":5}]
["Wayne Rooney - Man United",null,null,null,{"$f":"1+0+0","v":1},21,null,null,{"$f":"5*$E61","v":5},null,{"$f":"5*$E61","v":5},null,null,null,{"$f":"5*$E61","v":5},null,null,null,null,null,null,{"$f":"5*$E61","v":5},{"$f":"5*$E61","v":5},null,null,null,{"$f":"5*$E61","v":5},null,null,null,null,null,null,null,null,null,null,null,null,null,null,null,null,null,{"$f":"5*$E61","v":5},null,null,null,{"$f":"5*$E61","v":5},null,null,{"$f":"5*$E61","v":5},null,null,null,null,{"$f":"5*$E61","v":5},null,null,{"$f":"5*$E61","v":5},null,null,{"$f":"5*$E61","v":5},{"$f":"5*$E61","v":5},{"$f":"5*$E61","v":5},{"$f":"5*$E61","v":5},null,null,null,null,{"$f":"5*$E61","v":5},null,{"$f":"5*$E61","v":5},{"$f":"5*$E61","v":5},{"$f":"5*$E61","v":5},null,{"$f":"5*$E61","v":5},null,null,{"$f":"5*$E61","v":5}]
["Wilfried Bony - Swansea City",null,null,null,{"$f":"0+0+0","v":0},1,null,null,null,null,null,null,null,null,null,null,null,null,null,null,null,null,null,null,null,null,null,null,null,null,null,null,null,{"$f":"5*$E62","v":0}]
["Yaya Toure - Man City",null,null,null,{"$f":"0+0+0","v":0},3,null,null,null,null,null,null,null,null,null,null,null,null,null,null,null,null,null,null,null,null,null,null,null,null,{"$f":"5*$E63","v":0},null,null,null,null,null,null,null,null,null,null,null,null,null,null,null,null,null,null,null,null,null,null,null,null,null,null,null,null,null,null,null,null,null,null,null,null,null,null,{"$f":"5*$E63","v":0},null,{"$f":"5*$E63","v":0}]
[]
[]
["Sack Race"]
["Alan Irvine - West Brom",null,null,null,null,{"$f":"COUNT(G67:CB67)","v":5},null,null,null,null,null,null,{"$f":"25*$E67","v":0},null,null,null,null,null,{"$f":"25*$E67","v":0},null,null,null,null,null,null,null,null,null,null,null,null,null,{"$f":"25*$E67","v":0},null,null,null,null,null,null,null,null,null,null,null,null,null,null,null,null,null,null,null,null,null,null,null,null,null,null,null,null,null,{"$f":"25*$E67","v":0},null,null,null,null,null,null,null,null,null,{"$f":"25*$E67","v":0}]
["Alan Pardew - Newcastle",null,null,null,null,8,{"$f":"25*$E68","v":0},null,null,null,{"$f":"25*$E68","v":0},null,null,null,null,null,null,null,null,null,{"$f":"25*$E68","v":0},{"$f":"25*$E68","v":0},null,null,null,null,null,null,null,null,null,null,null,null,null,null,{"$f":"25*$E68","v":0},null,null,null,null,null,null,null,null,null,null,null,null,null,{"$f":"25*$E68","v":0},null,null,null,null,null,null,null,null,null,null,null,null,null,null,null,{"$f":"25*$E68","v":0},null,null,null,null,null,null,null,null,null,null,null,null,{"$f":"25*$E68","v":0}]
["Arsene Wenger - Arsenal",null,null,null,null,0]
["Brendan Rodgers - Liverpool",null,null,null,null,0]
["Garry Monk - Swansea City",null,null,null,null,6,null,null,null,null,null,null,null,null,null,null,null,null,null,null,null,null,null,null,null,null,{"$f":"25*$E71","v":0},{"$f":"25*$E71","v":0},null,null,null,null,null,null,null,null,null,null,null,null,null,null,null,null,null,null,null,null,{"$f":"25*$E71","v":0},null,null,null,{"$f":"25*$E71","v":0},null,{"$f":"25*$E71","v":0},null,null,null,null,null,null,null,null,{"$f":"25*$E71","v":0}]
["Gus Poyet - Sunderland",null,null,null,null,0]
["Harry Redknapp - QPR",null,null,null,null,2,null,null,null,null,null,null,null,null,null,null,null,null,null,null,null,null,null,null,null,null,null,null,null,null,null,null,null,null,null,null,null,null,null,{"$f":"25*$E73","v":0},null,null,null,null,null,null,null,null,null,null,null,null,null,null,null,null,null,null,null,null,null,null,null,null,null,null,null,null,null,{"$f":"25*$E73","v":0}]
["Jose Mourinho - Chelsea",null,null,null,null,0]
["Louis van Gaal - Man United",null,null,null,null,1,null,null,null,null,null,null,null,null,null,null,null,null,null,null,null,null,null,null,null,null,null,null,null,null,null,null,null,null,null,null,null,null,null,null,null,null,null,null,null,null,null,null,null,null,null,null,null,null,null,null,null,null,null,null,null,null,null,null,null,null,null,null,{"$f":"25*$E75","v":0}]
["Manuel Pellegrini - Man City",null,null,null,null,0]
["Mark Hughes - Stoke City",null,null,null,null,0]
["Mauricio Pochettino - Tottenham",null,null,null,null,0]
["Nigel Pearson - Leicester City",null,null,null,null,3,null,null,null,null,null,{"$f":"25*$E79","v":0},null,null,null,null,null,null,null,null,null,null,null,null,null,null,null,null,null,null,null,{"$f":"25*$E79","v":0},null,null,null,{"$f":"25*$E79","v":0}]
["Paul Lambert - Aston Villa",null,null,null,null,13,null,null,null,null,null,null,null,null,null,null,null,null,null,{"$f":"25*$E80","v":0},null,null,null,null,{"$f":"25*$E80","v":0},{"$f":"25*$E80","v":0},null,null,null,{"$f":"25*$E80","v":0},{"$f":"25*$E80","v":0},null,null,null,null,null,null,{"$f":"25*$E80","v":0},{"$f":"25*$E80","v":0},null,null,null,null,null,{"$f":"25*$E80","v":0},{"$f":"25*$E80","v":0},null,{"$f":"25*$E80","v":0},null,{"$f":"25*$E80","v":0},null,null,null,{"$f":"25*$E80","v":0},null,null,null,null,null,null,null,null,null,null,{"$f":"25*$E80","v":0}]
["Roberto Martinez - Everton",null,null,null,null,0]
["Ronald Koeman - Southampton",null,null,null,null,4,null,null,null,null,null,null,null,null,null,null,null,{"$f":"25*$E82","v":0},null,null,null,null,null,null,null,null,null,null,null,null,null,null,null,null,null,null,null,null,null,null,null,{"$f":"25*$E82","v":0},null,null,null,null,null,null,null,null,null,null,null,null,null,null,null,null,null,null,null,null,null,null,null,null,null,{"$f":"25*$E82","v":0},null,null,null,null,null,{"$f":"25*$E82","v":0}]
["Sam Allardyce - West Ham",null,null,null,null,27,null,null,{"$f":"25*$E83","v":0},{"$f":"25*$E83","v":0},null,null,null,{"$f":"25*$E83","v":0},{"$f":"25*$E83","v":0},{"$f":"25*$E83","v":0},{"$f":"25*$E83","v":0},null,null,null,null,null,{"$f":"25*$E83","v":0},{"$f":"25*$E83","v":0},null,null,null,null,{"$f":"25*$E83","v":0},null,null,null,null,{"$f":"25*$E83","v":0},{"$f":"25*$E83","v":0},null,null,null,null,null,{"$f":"25*$E83","v":0},null,{"$f":"25*$E83","v":0},{"$f":"25*$E83","v":0},null,null,{"$f":"25*$E83","v":0},null,null,null,null,{"$f":"25*$E83","v":0},null,null,null,{"$f":"25*$E83","v":0},{"$f":"25*$E83","v":0},null,null,{"$f":"25*$E83","v":0},{"$f":"25*$E83","v":0},null,null,null,null,{"$f":"25*$E83","v":0},null,null,null,null,{"$f":"25*$E83","v":0},{"$f":"25*$E83","v":0},null,null,{"$f":"25*$E83","v":0},{"$f":"25*$E83","v":0},{"$f":"25*$E83","v":0},null,{"$f":"25*$E83","v":0}]
["Sean Dyche - Burnley",null,null,null,null,4,null,{"$f":"25*$E84","v":0},null,null,null,null,null,null,null,null,null,null,null,null,null,null,null,null,null,null,null,null,null,null,null,null,null,null,null,null,null,null,null,null,null,null,null,null,null,null,null,null,null,null,null,null,null,null,null,null,null,{"$f":"25*$E84","v":0},{"$f":"25*$E84","v":0},null,null,{"$f":"25*$E84","v":0}]
["Steve Bruce - Hull City",null,null,null,null,1,null,null,null,null,null,null,null,null,null,null,null,null,null,null,null,null,null,null,null,null,null,null,null,null,null,null,null,null,null,null,null,null,null,null,null,null,null,null,null,null,null,null,null,null,null,null,null,null,null,null,null,null,null,null,null,null,null,null,null,null,null,null,null,null,null,null,null,null,null,null,null,{"$f":"25*$E85","v":0}]
[]
["Total Points - August",null,null,null,null,null,{"$f":"SUM(G2:G86)","v":80},90,80,105,95,115,105,110,130,115,95,105,115,120,95,95,90,105,105,100,75,110,110,105,115,130,110,110,105,105,100,85,{"$f":"SUM(AM2:AM86)","v":120},115,85,115,95,115,90,105,105,105,115,80,95,95,90,95,125,115,90,95,135,90,100,105,105,100,90,105,110,95,130,95,{"$f":"SUM(BS2:BS86)","v":90},70,100,110,110,100,100,105,110,130]
[]
[null,null,null,null,null,null,{"$f":"IF(COUNT(G48:G86)=4,\"a\",\"g\")","v":"a"},"a","a","a","a","a","a","a","a","a","a","a","a","a","a","a","a","a","a","a","a","a","a","a","a","a","a","a","a","a","a","a",{"$f":"IF(COUNT(AM48:AM86)=4,\"a\",\"g\")","v":"a"},"a","a","a","a","a","a","a","a","a","a","a","a","a","a","a","a","a","a","a","a","a","a","a","a","a","a","a","a","a","a","a",{"$f":"IF(COUNT(BS48:BS86)=4,\"a\",\"g\")","v":"a"},"a","a","a","a","a","a","a","a","a"]

{"sheet":"September","index":2,"n_rows":89,"n_cols":80,"rows_kept":89,"cut":false,"hidden":false,"merged":[[31,0,31,4],[41,0,41,4],[44,0,44,4],[1,0,1,4],[11,0,11,4],[14,0,14,4],[17,0,17,4],[25,0,25,4]]}
[null,null,null,null,null,null,"Aaron Byrne","Aidan Knight","Aidan Scanlon","Aidan White","Aiden Desch","Alan Boyle","Anastas Popov","Andy Dunne","Anthony Hughes","Barry Healy","Brendan Maguire","Brian Mullen","Brian Prendergast","Brian Sotolongo","Chris Hall","Ciaran O'Hart","Cillian Conway","Colin McAnaspie","Con McSweeney","Conor Horan","Craig Calvert","Dave Green","Dave McGinley","David Bone","David Byrne","David Cooney","David Keavney","Eamon Fox","Fiachra Moynihan","Gareth Pierpoint","Gary McGurk","Gavin Morgan","Gerry Draper","Gerry Moore","Ian Healy","Javier Suarez Barreiro","Jenny Ellis","Joe Behan","Joe O'Hehir","Joe Turner","Jonathan Fox","Keith Horan","Kevin Donohoe","Kevin Philpott","Konstantin Kulev","Kris Stainton","Liam Butler","Liam Geraghty","Maria Jordan","Mike Hall","Niall Carroll","Oisin O'Reilly","Padraic Carney","Pat Jordan","Paul Moore","Paul Prendergast","Paul Stainton","Peter Behan","Phil Doyle","Philip Jordan","Ralph Goodwin","Ray Ellis","Rhona Devlin","Richard Johnston","Sean Moloney","Sean O'Mairtin","Shane Horan","Sharon Behan","Simon Purdue","Siobhan Murphy","Terry Behan","Tiago Moreira","Tom McHugh","Wayne Donovan"]
["Saturday, September 13th"]
["Arsenal",2,2,"Man City","12:45:00",null,0,0,10,5,5,0,5,0,0,5,10,10,5,5,0,5,5,0,5,0,5,0,5,0,0,0,0,5,0,0,0,0,5,5,0,0,0,0,5,5,0,10,5,5,0,0,0,0,0,0,10,0,5,0,0,0,0,0,0,0,0,0,0,0,0,5,0,0,5,0,0,10,10,0]
["Chelsea",4,2,"Swansea City","15:00:00",null,5,5,5,5,5,5,5,5,5,5,5,5,5,5,5,5,5,5,5,5,5,5,5,5,5,5,5,5,5,5,5,5,5,5,5,5,5,10,5,5,5,5,5,5,5,5,5,5,5,5,5,5,5,5,5,5,5,5,5,5,5,5,5,5,5,5,5,5,5,5,5,0,5,5]
["Crystal Palace",0,0,"Burnley","15:00:00",null,5,0,0,10,0,0,0,0,5,0,0,5,0,10,0,0,0,10,0,0,0,0,0,0,0,5,0,0,0,0,0,0,0,0,0,0,0,5,0,0,0,0,0,5,0,0,5,5,5,0,0,0,0,0,5,0,0,0,5,5,0,5,0,0,0,0,0,5,0,5,0,5,0,0]
["Southampton",4,0,"Newcastle United","15:00:00",null,0,0,5,5,0,0,5,5,5,5,0,0,5,5,0,5,5,5,5,0,5,5,5,0,0,5,5,5,5,0,5,5,5,5,5,5,5,5,5,5,5,5,5,5,5,5,5,5,0,5,5,0,5,5,5,5,5,0,5,5,5,0,0,0,0,5,0,5,5,5,5,0,5,5]
["Stoke City",0,1,"Leicester City","15:00:00",null,0,0,0,0,0,0,0,0,0,0,0,0,0,0,0,0,0,0,0,0,0,0,0,0,0,0,0,0,0,0,0,0,0,0,0,0,0,0,0,0,0,0,0,0,0,10,0,0,0,0,0,0,0,0,0,0,0,0,0,0,0,0,0,0,0,0,0,0,0,0,0,0,0,0]
["Sunderland",2,2,"Tottenham","15:00:00",null,0,0,10,0,0,0,0,5,0,0,0,0,0,0,0,0,5,0,0,0,5,0,0,0,0,0,5,5,5,0,5,0,5,0,0,0,0,0,5,5,0,0,0,0,0,0,0,10,0,0,0,0,5,0,5,5,0,0,0,0,0,0,0,0,0,0,0,0,0,0,5,10,0,5]
["West Brom",0,2,"Everton","15:00:00",null,0,5,5,5,5,5,5,5,5,0,10,5,5,5,0,5,5,5,10,5,5,5,5,0,5,5,5,5,5,10,0,5,5,10,5,0,5,10,5,0,5,0,5,5,5,5,5,5,10,5,5,0,0,5,5,0,0,5,5,5,5,5,10,5,0,5,10,5,5,5,0,0,5,5]
["Liverpool",0,1,"Aston Villa","17:30:00",null,0,0,0,0,0,0,0,0,0,0,0,0,0,0,0,0,0,0,0,0,0,0,0,0,0,0,0,0,0,0,0,0,0,0,0,0,0,0,0,0,0,0,0,0,0,0,0,0,0,0,0,0,0,0,0,0,0,0,0,0,0,0,0,0,0,0,0,0,0,0,0,0,0,0]
[]
["Sunday, September 14th"]
["Man United",4,0,"QPR","16:00:00",null,5,5,5,5,5,10,5,5,5,5,5,5,5,5,10,5,10,5,5,5,5,5,5,5,5,5,5,5,5,5,10,5,5,5,5,5,5,5,5,5,5,5,5,5,10,10,0,5,5,5,5,10,5,10,10,5,5,5,5,5,5,5,5,0,5,5,10,5,5,5,10,0,5,5]
[]
["Monday, September 15th"]
["Hull City",2,2,"West Ham","20:00:00",null,10,5,5,0,0,0,0,10,0,5,0,5,10,0,0,5,0,5,5,0,0,10,5,0,0,0,0,5,0,5,10,0,5,5,0,0,0,0,0,0,0,10,0,0,10,0,0,5,5,5,0,5,0,0,0,0,0,0,5,0,0,0,5,0,0,0,0,0,0,0,0,10,0,5]
[]
["Saturday, September 20th"]
["QPR",2,2,"Stoke City","12:45:00",null,5,5,0,5,5,0,5,0,0,5,5,5,5,0,0,0,5,0,5,0,5,5,5,0,0,5,5,5,5,0,5,0,0,0,0,5,0,0,0,10,0,5,5,5,0,0,0,0,0,0,5,0,0,0,5,5,0,5,0,0,0,0,0,0,0,5,0,5,0,0,0,10,0,5]
["Aston Villa",0,3,"Arsenal","15:00:00",null,5,5,0,0,0,5,5,0,5,5,5,5,5,5,5,5,5,0,5,5,5,5,5,5,5,0,5,0,5,5,5,5,0,5,5,0,5,0,0,0,5,0,5,5,5,0,0,0,5,5,0,5,0,5,0,5,0,0,5,5,5,0,0,5,0,5,10,5,0,5,0,0,5,0]
["Burnley",0,0,"Sunderland","15:00:00",null,0,0,0,0,0,0,0,5,5,0,5,0,10,5,0,0,0,0,0,5,0,5,5,0,0,0,5,5,0,0,0,5,10,0,0,0,5,10,0,0,0,0,5,5,0,0,0,0,5,0,0,0,10,0,0,0,0,0,0,0,0,0,10,0,0,5,0,5,0,5,0,5,10,0]
["Newcastle United",2,2,"Hull City","15:00:00",null,5,0,10,0,0,0,0,5,0,5,0,0,10,0,5,5,5,10,0,0,10,0,10,0,0,0,0,0,0,0,0,0,0,5,0,0,0,0,0,0,0,0,0,0,0,0,0,0,0,0,10,5,0,5,5,5,0,0,0,10,0,0,5,0,0,0,0,0,0,0,0,10,0,5]
["Swansea City",0,1,"Southampton","15:00:00",null,0,0,0,0,0,0,0,0,0,0,0,0,0,0,0,0,0,0,0,5,0,0,0,0,0,0,0,0,0,0,0,0,0,5,5,5,0,0,5,0,0,0,0,0,0,5,0,0,0,10,0,5,0,0,0,0,0,0,0,0,0,0,0,0,0,0,0,0,0,0,0,0,0,0]
["West Ham",3,1,"Liverpool","17:30:00",null,0,0,5,0,0,0,0,0,0,0,0,0,5,5,0,0,0,0,0,0,0,0,0,0,0,0,0,0,0,0,0,0,0,0,0,0,0,0,0,5,0,0,0,0,0,0,0,5,0,0,10,0,0,0,0,0,5,0,0,0,0,0,0,0,0,0,0,0,0,5,0,0,0,0]
[]
["Sunday, September 21st"]
["Leicester City",5,3,"Man United","13:30:00",null,0,0,0,0,0,0,0,0,0,0,0,0,0,0,0,0,0,0,0,0,0,0,0,0,0,0,0,0,0,0,0,0,0,0,0,0,0,0,0,0,0,0,0,0,0,0,0,0,0,0,0,0,0,0,0,0,5,0,0,0,0,0,0,0,0,0,0,0,0,0,0,0,0,0]
["Tottenham",0,1,"West Brom","13:30:00",null,0,0,0,0,0,0,0,0,0,0,0,0,0,0,0,0,0,0,0,0,0,0,0,0,0,0,0,0,0,0,0,0,0,0,0,0,0,0,0,0,0,0,0,0,0,0,0,0,0,0,0,0,0,0,0,0,0,0,0,0,0,0,0,0,0,0,0,0,0,0,0,0,0,0]
["Everton",2,3,"Crystal Palace","16:00:00",null,0,0,0,0,0,0,0,0,0,0,0,0,0,0,0,0,0,0,0,0,0,0,0,0,0,0,0,0,0,0,0,0,0,0,0,0,0,0,0,0,0,0,0,0,0,0,0,0,0,0,0,0,0,0,0,0,0,0,0,0,0,0,0,0,0,0,0,0,0,0,0,0,0,0]
["Man City",1,1,"Chelsea","16:00:00",null,0,5,0,0,10,0,10,5,5,10,10,5,0,10,0,10,10,10,10,5,10,5,10,5,5,0,10,10,10,0,5,5,5,10,0,0,0,0,0,0,10,10,10,5,0,5,5,0,0,0,10,5,10,0,5,5,0,0,5,5,10,0,5,0,10,10,5,10,0,0,0,5,0,10]
[]
["Saturday, September 27th"]
["Liverpool",1,1,"Everton","12:45:00",null,0,10,5,10,5,0,0,0,10,10,5,10,0,0,0,0,10,10,10,0,5,5,10,0,0,5,0,0,5,0,0,10,0,5,10,0,0,5,10,0,0,0,10,5,0,10,0,0,0,10,0,0,0,0,0,0,0,0,5,0,0,0,0,0,0,0,0,10,5,0,5,10,5,10]
["Chelsea",3,0,"Aston Villa","15:00:00",null,10,10,10,5,5,5,5,5,5,5,5,5,5,5,10,5,10,10,5,10,5,5,5,5,10,5,5,5,10,5,10,5,5,5,5,5,5,5,10,5,10,5,5,5,10,5,5,5,5,10,5,5,5,5,5,10,5,10,5,10,5,5,0,5,5,5,5,10,10,5,5,10,5,5]
["Crystal Palace",2,0,"Leicester City","15:00:00",null,0,0,5,0,0,5,5,0,0,5,0,0,10,5,5,0,5,0,0,0,0,0,0,0,10,0,5,0,0,0,0,5,0,0,0,0,5,0,0,5,5,0,5,0,5,0,0,0,5,5,0,0,0,0,0,5,0,0,0,5,5,0,5,0,10,5,0,0,0,0,0,0,0,0]
["Hull City",2,4,"Man City","15:00:00",null,5,5,5,5,5,5,5,5,5,5,5,5,5,5,5,5,5,5,5,5,5,5,5,5,5,5,5,5,5,5,0,5,5,5,5,5,0,5,5,5,5,5,5,5,5,5,5,5,5,5,5,5,5,5,5,5,5,5,5,5,0,5,5,5,5,5,5,5,5,5,5,5,5,5]
["Man United",2,1,"West Ham","15:00:00",null,10,5,5,10,10,5,5,0,5,10,5,10,5,10,5,5,10,5,5,0,5,5,5,5,5,5,5,10,5,10,5,5,0,0,10,0,5,5,5,5,10,10,5,5,5,5,0,0,10,10,5,10,10,5,0,5,5,5,5,5,5,10,0,10,5,5,5,5,5,10,5,5,5,5]
["Southampton",2,1,"QPR","15:00:00",null,5,5,5,5,5,10,5,10,5,5,5,5,10,10,0,10,10,5,5,10,5,5,10,5,5,5,5,5,5,5,5,5,5,5,5,5,5,5,5,5,5,5,5,10,10,5,5,5,0,5,10,10,5,10,5,5,5,5,5,5,5,5,0,5,5,5,10,10,5,5,5,5,5,10]
["Sunderland",0,0,"Swansea City","15:00:00",null,0,0,0,5,5,0,5,5,0,0,5,5,5,0,0,0,5,0,0,0,0,0,5,5,5,0,0,5,5,5,5,0,5,5,0,5,0,0,10,5,0,10,0,5,10,10,0,5,0,10,0,5,5,0,5,10,0,10,0,0,0,0,5,5,0,5,5,5,5,5,5,10,0,0]
["Arsenal",1,1,"Tottenham","17:30:00",null,0,0,0,5,10,0,0,0,0,0,0,0,0,0,0,0,0,10,0,0,0,10,0,0,0,0,0,0,0,0,5,0,0,0,0,5,0,0,0,0,0,0,0,0,0,5,10,5,0,0,0,10,0,0,0,0,0,0,0,0,0,0,0,0,0,0,0,0,0,0,0,0,5,0]
[]
["Sunday, September 28th"]
["West Brom",4,0,"Burnley","16:00:00",null,5,5,5,5,0,5,5,0,0,0,5,0,0,0,5,5,5,5,5,0,0,0,5,0,0,5,5,5,5,5,0,5,0,5,5,0,5,0,5,5,5,5,5,0,5,5,5,5,5,0,5,5,5,5,0,5,0,5,0,5,5,5,0,5,5,5,5,5,0,0,5,0,0,5]
[]
["Monday, September 29th"]
["Stoke City",1,0,"Newcastle United","20:00:00",null,0,10,0,10,10,5,5,0,10,5,0,5,0,5,0,0,5,10,0,0,10,0,5,10,0,5,5,0,0,5,0,10,5,5,0,0,10,5,5,5,10,5,0,5,5,5,5,5,0,10,5,0,0,5,5,5,5,10,5,5,10,5,10,5,5,0,0,10,5,10,5,0,5,0]
[]
["Golden Boots"]
["Alexis Sanchez - Arsenal",null,null,null,{"$f":"1+0+0","v":1},{"$f":"COUNT(G49:CB49)","v":14},null,{"$f":"5*$E49","v":5},null,null,null,null,null,{"$f":"5*$E49","v":5},null,null,null,null,null,{"$f":"5*$E49","v":5},null,null,null,null,{"$f":"5*$E49","v":5},{"$f":"5*$E49","v":5},null,null,{"$f":"5*$E49","v":5},null,null,null,null,null,null,null,null,null,null,null,null,null,{"$f":"5*$E49","v":5},null,{"$f":"5*$E49","v":5},null,null,null,null,null,null,{"$f":"5*$E49","v":5},null,null,null,null,null,{"$f":"5*$E49","v":5},null,null,null,null,{"$f":"5*$E49","v":5},{"$f":"5*$E49","v":5},null,null,null,null,null,null,null,null,null,{"$f":"5*$E49","v":5},null,null,null,{"$f":"5*$E49","v":5}]
["Daniel Sturridge - Liverpool",null,null,null,{"$f":"0+0+0","v":0},52,{"$f":"5*$E50","v":0},null,{"$f":"5*$E50","v":0},{"$f":"5*$E50","v":0},{"$f":"5*$E50","v":0},null,{"$f":"5*$E50","v":0},{"$f":"5*$E50","v":0},{"$f":"5*$E50","v":0},{"$f":"5*$E50","v":0},{"$f":"5*$E50","v":0},{"$f":"5*$E50","v":0},{"$f":"5*$E50","v":0},null,null,{"$f":"5*$E50","v":0},{"$f":"5*$E50","v":0},{"$f":"5*$E50","v":0},null,{"$f":"5*$E50","v":0},{"$f":"5*$E50","v":0},{"$f":"5*$E50","v":0},null,null,{"$f":"5*$E50","v":0},{"$f":"5*$E50","v":0},{"$f":"5*$E50","v":0},null,{"$f":"5*$E50","v":0},0,0,0,0,null,0,0,null,{"$f":"5*$E50","v":0},{"$f":"5*$E50","v":0},null,{"$f":"5*$E50","v":0},{"$f":"5*$E50","v":0},null,{"$f":"5*$E50","v":0},{"$f":"5*$E50","v":0},null,{"$f":"5*$E50","v":0},{"$f":"5*$E50","v":0},{"$f":"5*$E50","v":0},{"$f":"5*$E50","v":0},{"$f":"5*$E50","v":0},{"$f":"5*$E50","v":0},null,null,{"$f":"5*$E50","v":0},{"$f":"5*$E50","v":0},{"$f":"5*$E50","v":0},0,{"$f":"5*$E50","v":0},null,null,null,{"$f":"5*$E50","v":0},null,{"$f":"5*$E50","v":0},{"$f":"5*$E50","v":0},{"$f":"5*$E50","v":0},null,{"$f":"5*$E50","v":0},{"$f":"5*$E50","v":0},null,null,{"$f":"5*$E50","v":0},{"$f":"5*$E50","v":0}]
["Diego Costa - Chelsea",null,null,null,{"$f":"3+0+1","v":4},39,null,{"$f":"5*$E51","v":20},null,20,null,{"$f":"5*$E51","v":20},{"$f":"5*$E51","v":20},null,20,{"$f":"5*$E51","v":20},null,null,{"$f":"5*$E51","v":20},{"$f":"5*$E51","v":20},null,null,null,null,null,{"$f":"5*$E51","v":20},null,{"$f":"5*$E51","v":20},{"$f":"5*$E51","v":20},null,20,{"$f":"5*$E51","v":20},{"$f":"5*$E51","v":20},{"$f":"5*$E51","v":20},null,{"$f":"5*$E51","v":20},{"$f":"5*$E51","v":20},null,null,null,{"$f":"5*$E51","v":20},{"$f":"5*$E51","v":20},null,{"$f":"5*$E51","v":20},null,{"$f":"5*$E51","v":20},20,{"$f":"5*$E51","v":20},{"$f":"5*$E51","v":20},null,null,{"$f":"5*$E51","v":20},{"$f":"5*$E51","v":20},{"$f":"5*$E51","v":20},null,{"$f":"5*$E51","v":20},null,{"$f":"5*$E51","v":20},{"$f":"5*$E51","v":20},{"$f":"5*$E51","v":20},{"$f":"5*$E51","v":20},null,null,null,null,{"$f":"5*$E51","v":20},{"$f":"5*$E51","v":20},{"$f":"5*$E51","v":20},null,{"$f":"5*$E51","v":20},null,null,null,null,null,null,null,{"$f":"5*$E51","v":20},{"$f":"5*$E51","v":20},20]
["Eden Hazard - Chelsea",null,null,null,{"$f":"0+0+0","v":0},2,null,null,null,null,{"$f":"5*$E52","v":0},null,null,null,null,null,null,null,null,null,null,null,null,null,null,null,null,null,null,null,null,null,null,null,null,null,null,null,null,null,null,null,null,null,null,null,null,null,null,null,null,null,null,null,null,null,null,null,null,null,null,null,null,null,null,null,null,null,null,null,null,null,null,null,null,{"$f":"5*$E52","v":0}]
["Edin Dzeko - Man City",null,null,null,{"$f":"0+0+2","v":2},6,null,null,null,null,null,{"$f":"5*$E53","v":10},null,null,null,null,null,null,null,null,null,null,null,null,null,null,null,{"$f":"5*$E53","v":10},null,null,null,null,null,null,null,null,null,null,null,null,null,null,{"$f":"5*$E53","v":10},null,null,{"$f":"5*$E53","v":10},null,null,null,null,null,null,null,null,null,null,null,null,null,null,null,null,null,null,null,null,null,{"$f":"5*$E53","v":10},null,null,null,null,null,{"$f":"5*$E53","v":10}]
["Emmanuel Adebayor - Tottenham",null,null,null,{"$f":"0+0+0","v":0},3,null,null,null,null,null,null,null,null,null,null,null,null,null,null,{"$f":"5*$E54","v":0},null,null,null,null,null,null,null,null,null,null,null,null,null,null,null,null,null,null,{"$f":"5*$E54","v":0},null,null,null,null,null,null,null,null,null,null,null,null,null,null,null,null,null,null,null,null,null,null,null,null,null,null,null,null,null,null,{"$f":"5*$E54","v":0}]
["Olivier Giroud - Arsenal",null,null,null,{"$f":"0+0+0","v":0},4,null,null,null,null,null,{"$f":"5*$E55","v":0},null,null,null,null,null,null,null,null,null,null,null,null,null,null,null,null,null,{"$f":"5*$E55","v":0},null,null,null,null,null,null,null,null,null,0,null,null,null,null,null,null,null,{"$f":"5*$E55","v":0}]
["Raheem Sterling - Liverpool",null,null,null,{"$f":"0+1+0","v":1},3,null,null,null,null,null,null,null,null,null,null,null,null,null,null,null,null,null,null,null,null,null,null,null,null,null,null,null,null,null,null,null,null,null,null,null,null,null,null,null,{"$f":"5*$E56","v":5},null,null,null,null,null,null,null,null,null,null,null,null,null,null,null,null,null,null,null,null,null,null,{"$f":"5*$E56","v":5},null,null,null,{"$f":"5*$E56","v":5}]
["Robin van Persie - Man United",null,null,null,{"$f":"0+1+1","v":2},45,{"$f":"5*$E57","v":10},{"$f":"5*$E57","v":10},null,{"$f":"5*$E57","v":10},null,null,null,null,null,{"$f":"5*$E57","v":10},{"$f":"5*$E57","v":10},{"$f":"5*$E57","v":10},{"$f":"5*$E57","v":10},null,{"$f":"5*$E57","v":10},{"$f":"5*$E57","v":10},null,{"$f":"5*$E57","v":10},{"$f":"5*$E57","v":10},null,{"$f":"5*$E57","v":10},null,null,{"$f":"5*$E57","v":10},null,{"$f":"5*$E57","v":10},{"$f":"5*$E57","v":10},{"$f":"5*$E57","v":10},{"$f":"5*$E57","v":10},{"$f":"5*$E57","v":10},null,{"$f":"5*$E57","v":10},{"$f":"5*$E57","v":10},null,null,{"$f":"5*$E57","v":10},{"$f":"5*$E57","v":10},{"$f":"5*$E57","v":10},null,null,{"$f":"5*$E57","v":10},null,{"$f":"5*$E57","v":10},{"$f":"5*$E57","v":10},{"$f":"5*$E57","v":10},null,{"$f":"5*$E57","v":10},{"$f":"5*$E57","v":10},{"$f":"5*$E57","v":10},{"$f":"5*$E57","v":10},{"$f":"5*$E57","v":10},null,{"$f":"5*$E57","v":10},{"$f":"5*$E57","v":10},{"$f":"5*$E57","v":10},{"$f":"5*$E57","v":10},null,null,{"$f":"5*$E57","v":10},{"$f":"5*$E57","v":10},{"$f":"5*$E57","v":10},{"$f":"5*$E57","v":10},null,{"$f":"5*$E57","v":10},null,{"$f":"5*$E57","v":10},null,null,null,{"$f":"5*$E57","v":10},{"$f":"5*$E57","v":10},null,{"$f":"5*$E57","v":10}]
["Romelu Lukaku - Everton",null,null,null,{"$f":"1+1+0","v":2},7,{"$f":"5*$E58","v":10},null,{"$f":"5*$E58","v":10},null,null,null,null,null,null,null,null,null,null,{"$f":"5*$E58","v":10},{"$f":"5*$E58","v":10},null,null,null,null,null,null,null,null,null,null,null,null,null,null,null,null,null,null,null,null,null,null,null,null,null,null,null,null,{"$f":"5*$E58","v":10},null,null,null,null,null,null,null,null,null,null,null,null,null,null,null,null,null,null,null,null,null,null,null,null,null,null,{"$f":"5*$E58","v":10},{"$f":"5*$E58","v":10}]
["Sergio Aguero - Man City",null,null,null,{"$f":"1+0+1","v":2},21,null,null,null,null,null,null,{"$f":"5*$E59","v":10},{"$f":"5*$E59","v":10},null,null,{"$f":"5*$E59","v":10},{"$f":"5*$E59","v":10},null,null,null,null,{"$f":"5*$E59","v":10},{"$f":"5*$E59","v":10},{"$f":"5*$E59","v":10},null,null,null,{"$f":"5*$E59","v":10},{"$f":"5*$E59","v":10},null,null,null,null,{"$f":"5*$E59","v":10},null,{"$f":"5*$E59","v":10},{"$f":"5*$E59","v":10},{"$f":"5*$E59","v":10},{"$f":"5*$E59","v":10},{"$f":"5*$E59","v":10},null,null,null,null,null,null,null,null,null,{"$f":"5*$E59","v":10},null,null,null,{"$f":"5*$E59","v":10},null,null,null,{"$f":"5*$E59","v":10},null,null,{"$f":"5*$E59","v":10},null,null,null,null,{"$f":"5*$E59","v":10},null,null,null,null,null,null,null,{"$f":"5*$E59","v":10}]
["Steven Gerrard - Liverpool",null,null,null,{"$f":"0+0+1","v":1},1,null,null,null,null,null,null,null,null,null,null,null,null,null,null,null,null,null,null,null,null,null,null,null,null,null,null,null,null,null,null,null,null,null,null,null,null,null,null,null,null,null,null,null,null,null,null,null,null,null,null,null,null,null,null,null,null,null,null,null,null,null,null,{"$f":"5*$E60","v":5}]
["Wayne Rooney - Man United",null,null,null,{"$f":"1+0+1","v":2},21,null,null,{"$f":"5*$E61","v":10},null,{"$f":"5*$E61","v":10},null,null,null,{"$f":"5*$E61","v":10},null,null,null,null,null,null,{"$f":"5*$E61","v":10},{"$f":"5*$E61","v":10},null,null,null,{"$f":"5*$E61","v":10},null,null,null,null,null,null,null,null,null,null,null,null,null,null,null,null,null,{"$f":"5*$E61","v":10},null,null,null,{"$f":"5*$E61","v":10},null,null,{"$f":"5*$E61","v":10},null,null,null,null,{"$f":"5*$E61","v":10},null,null,{"$f":"5*$E61","v":10},null,null,{"$f":"5*$E61","v":10},{"$f":"5*$E61","v":10},{"$f":"5*$E61","v":10},{"$f":"5*$E61","v":10},null,null,null,null,{"$f":"5*$E61","v":10},null,{"$f":"5*$E61","v":10},{"$f":"5*$E61","v":10},{"$f":"5*$E61","v":10},null,{"$f":"5*$E61","v":10},null,null,{"$f":"5*$E61","v":10}]
["Wilfried Bony - Swansea City",null,null,null,{"$f":"0+0+0","v":0},1,null,null,null,null,null,null,null,null,null,null,null,null,null,null,null,null,null,null,null,null,null,null,null,null,null,null,null,{"$f":"5*$E62","v":0}]
["Yaya Toure - Man City",null,null,null,{"$f":"0+0+0","v":0},3,null,null,null,null,null,null,null,null,null,null,null,null,null,null,null,null,null,null,null,null,null,null,null,null,{"$f":"5*$E63","v":0},null,null,null,null,null,null,null,null,null,null,null,null,null,null,null,null,null,null,null,null,null,null,null,null,null,null,null,null,null,null,null,null,null,null,null,null,null,null,{"$f":"5*$E63","v":0},null,{"$f":"5*$E63","v":0}]
[]
[]
["Sack Race"]
["Alan Irvine - West Brom",null,null,null,null,{"$f":"COUNT(G67:CB67)","v":5},null,null,null,null,null,null,{"$f":"25*$E67","v":0},null,null,null,null,null,{"$f":"25*$E67","v":0},null,null,null,null,null,null,null,null,null,null,null,null,null,{"$f":"25*$E67","v":0},null,null,null,null,null,null,null,null,null,null,null,null,null,null,null,null,null,null,null,null,null,null,null,null,null,null,null,null,null,{"$f":"25*$E67","v":0},null,null,null,null,null,null,null,null,null,{"$f":"25*$E67","v":0}]
["Alan Pardew - Newcastle",null,null,null,null,8,{"$f":"25*$E68","v":0},null,null,null,{"$f":"25*$E68","v":0},null,null,null,null,null,null,null,null,null,{"$f":"25*$E68","v":0},{"$f":"25*$E68","v":0},null,null,null,null,null,null,null,null,null,null,null,null,null,null,{"$f":"25*$E68","v":0},null,null,null,null,null,null,null,null,null,null,null,null,null,{"$f":"25*$E68","v":0},null,null,null,null,null,null,null,null,null,null,null,null,null,null,null,{"$f":"25*$E68","v":0},null,null,null,null,null,null,null,null,null,null,null,null,{"$f":"25*$E68","v":0}]
["Arsene Wenger - Arsenal",null,null,null,null,0]
["Brendan Rodgers - Liverpool",null,null,null,null,0]
["Garry Monk - Swansea City",null,null,null,null,6,null,null,null,null,null,null,null,null,null,null,null,null,null,null,null,null,null,null,null,null,{"$f":"25*$E71","v":0},{"$f":"25*$E71","v":0},null,null,null,null,null,null,null,null,null,null,null,null,null,null,null,null,null,null,null,null,{"$f":"25*$E71","v":0},null,null,null,{"$f":"25*$E71","v":0},null,{"$f":"25*$E71","v":0},null,null,null,null,null,null,null,null,{"$f":"25*$E71","v":0}]
["Gus Poyet - Sunderland",null,null,null,null,0]
["Harry Redknapp - QPR",null,null,null,null,2,null,null,null,null,null,null,null,null,null,null,null,null,null,null,null,null,null,null,null,null,null,null,null,null,null,null,null,null,null,null,null,null,null,{"$f":"25*$E73","v":0},null,null,null,null,null,null,null,null,null,null,null,null,null,null,null,null,null,null,null,null,null,null,null,null,null,null,null,null,null,{"$f":"25*$E73","v":0}]
["Jose Mourinho - Chelsea",null,null,null,null,0]
["Louis van Gaal - Man United",null,null,null,null,1,null,null,null,null,null,null,null,null,null,null,null,null,null,null,null,null,null,null,null,null,null,null,null,null,null,null,null,null,null,null,null,null,null,null,null,null,null,null,null,null,null,null,null,null,null,null,null,null,null,null,null,null,null,null,null,null,null,null,null,null,null,null,{"$f":"25*$E75","v":0}]
["Manuel Pellegrini - Man City",null,null,null,null,0]
["Mark Hughes - Stoke City",null,null,null,null,0]
["Mauricio Pochettino - Tottenham",null,null,null,null,0]
["Nigel Pearson - Leicester City",null,null,null,null,3,null,null,null,null,null,{"$f":"25*$E79","v":0},null,null,null,null,null,null,null,null,null,null,null,null,null,null,null,null,null,null,null,{"$f":"25*$E79","v":0},null,null,null,{"$f":"25*$E79","v":0}]
["Paul Lambert - Aston Villa",null,null,null,null,13,null,null,null,null,null,null,null,null,null,null,null,null,null,{"$f":"25*$E80","v":0},null,null,null,null,{"$f":"25*$E80","v":0},{"$f":"25*$E80","v":0},null,null,null,{"$f":"25*$E80","v":0},{"$f":"25*$E80","v":0},null,null,null,null,null,null,{"$f":"25*$E80","v":0},{"$f":"25*$E80","v":0},null,null,null,null,null,{"$f":"25*$E80","v":0},{"$f":"25*$E80","v":0},null,{"$f":"25*$E80","v":0},null,{"$f":"25*$E80","v":0},null,null,null,{"$f":"25*$E80","v":0},null,null,null,null,null,null,null,null,null,null,{"$f":"25*$E80","v":0}]
["Roberto Martinez - Everton",null,null,null,null,0]
["Ronald Koeman - Southampton",null,null,null,null,4,null,null,null,null,null,null,null,null,null,null,null,{"$f":"25*$E82","v":0},null,null,null,null,null,null,null,null,null,null,null,null,null,null,null,null,null,null,null,null,null,null,null,{"$f":"25*$E82","v":0},null,null,null,null,null,null,null,null,null,null,null,null,null,null,null,null,null,null,null,null,null,null,null,null,null,{"$f":"25*$E82","v":0},null,null,null,null,null,{"$f":"25*$E82","v":0}]
["Sam Allardyce - West Ham",null,null,null,null,27,null,null,{"$f":"25*$E83","v":0},{"$f":"25*$E83","v":0},null,null,null,{"$f":"25*$E83","v":0},{"$f":"25*$E83","v":0},{"$f":"25*$E83","v":0},{"$f":"25*$E83","v":0},null,null,null,null,null,{"$f":"25*$E83","v":0},{"$f":"25*$E83","v":0},null,null,null,null,{"$f":"25*$E83","v":0},null,null,null,null,{"$f":"25*$E83","v":0},{"$f":"25*$E83","v":0},null,null,null,null,null,{"$f":"25*$E83","v":0},null,{"$f":"25*$E83","v":0},{"$f":"25*$E83","v":0},null,null,{"$f":"25*$E83","v":0},null,null,null,null,{"$f":"25*$E83","v":0},null,null,null,{"$f":"25*$E83","v":0},{"$f":"25*$E83","v":0},null,null,{"$f":"25*$E83","v":0},{"$f":"25*$E83","v":0},null,null,null,null,{"$f":"25*$E83","v":0},null,null,null,null,{"$f":"25*$E83","v":0},{"$f":"25*$E83","v":0},null,null,{"$f":"25*$E83","v":0},{"$f":"25*$E83","v":0},{"$f":"25*$E83","v":0},null,{"$f":"25*$E83","v":0}]
["Sean Dyche - Burnley",null,null,null,null,4,null,{"$f":"25*$E84","v":0},null,null,null,null,null,null,null,null,null,null,null,null,null,null,null,null,null,null,null,null,null,null,null,null,null,null,null,null,null,null,null,null,null,null,null,null,null,null,null,null,null,null,null,null,null,null,null,null,null,{"$f":"25*$E84","v":0},{"$f":"25*$E84","v":0},null,null,{"$f":"25*$E84","v":0}]
["Steve Bruce - Hull City",null,null,null,null,1,null,null,null,null,null,null,null,null,null,null,null,null,null,null,null,null,null,null,null,null,null,null,null,null,null,null,null,null,null,null,null,null,null,null,null,null,null,null,null,null,null,null,null,null,null,null,null,null,null,null,null,null,null,null,null,null,null,null,null,null,null,null,null,null,null,null,null,null,null,null,null,{"$f":"25*$E85","v":0}]
[]
["Total Points - September",null,null,null,null,null,{"$f":"SUM(G2:G86)","v":95},120,120,130,100,95,115,90,110,125,110,115,140,135,75,100,145,135,115,85,115,115,150,75,85,95,115,120,105,100,110,105,{"$f":"SUM(AM2:AM86)","v":95},105,100,80,90,105,105,115,115,115,130,110,115,135,90,110,90,135,120,115,120,110,105,110,65,85,90,125,110,95,80,85,{"$f":"SUM(BS2:BS86)","v":70},95,90,135,85,90,95,145,110,120]
[]
[null,null,null,null,null,null,{"$f":"IF(COUNT(G48:G86)=4,\"a\",\"g\")","v":"a"},"a","a","a","a","a","a","a","a","a","a","a","a","a","a","a","a","a","a","a","a","a","a","a","a","a","a","a","a","a","a","a","a","a","a","a","a","a","a","a","a","a","a","a","a","a","a","a","a","a","a","a","a","a","a","a","a","a","a","a","a","a","a","a",{"$f":"IF(COUNT(BS48:BS86)=4,\"a\",\"g\")","v":"a"},"a","a","a","a","a","a","a","a","a"]

{"sheet":"October","index":3,"n_rows":89,"n_cols":80,"rows_kept":89,"cut":false,"hidden":false,"merged":[[31,0,31,4],[39,0,39,4],[44,0,44,4],[1,0,1,4],[9,0,9,4],[15,0,15,4],[24,0,24,4],[28,0,28,4]]}
[null,null,null,null,null,null,"Aaron Byrne","Aidan Knight","Aidan Scanlon","Aidan White","Aiden Desch","Alan Boyle","Anastas Popov","Andy Dunne","Anthony Hughes","Barry Healy","Brendan Maguire","Brian Mullen","Brian Prendergast","Brian Sotolongo","Chris Hall","Ciaran O'Hart","Cillian Conway","Colin McAnaspie","Con McSweeney","Conor Horan","Craig Calvert","Dave Green","Dave McGinley","David Bone","David Byrne","David Cooney","David Keavney","Eamon Fox","Fiachra Moynihan","Gareth Pierpoint","Gary McGurk","Gavin Morgan","Gerry Draper","Gerry Moore","Ian Healy","Javier Suarez Barreiro","Jenny Ellis","Joe Behan","Joe O'Hehir","Joe Turner","Jonathan Fox","Keith Horan","Kevin Donohoe","Kevin Philpott","Konstantin Kulev","Kris Stainton","Liam Butler","Liam Geraghty","Maria Jordan","Mike Hall","Niall Carroll","Oisin O'Reilly","Padraic Carney","Pat Jordan","Paul Moore","Paul Prendergast","Paul Stainton","Peter Behan","Phil Doyle","Philip Jordan","Ralph Goodwin","Ray Ellis","Rhona Devlin","Richard Johnston","Sean Moloney","Sean O'Mairtin","Shane Horan","Sharon Behan","Simon Purdue","Siobhan Murphy","Terry Behan","Tiago Moreira","Tom McHugh","Wayne Donovan"]
["Saturday, October 4th"]
["Hull City",2,0,"Crystal Palace","15:00:00",null,5,5,0,0,10,5,0,5,5,0,10,0,5,5,0,0,0,0,5,0,5,0,5,10,5,0,5,5,5,0,10,5,0,0,0,0,5,0,5,5,5,0,5,5,5,5,0,0,0,0,5,5,5,5,5,5,0,5,10,5,5,5,0,0,0,0,5,5,5,5,0,0,5,5]
["Leicester City",2,2,"Burnley","15:00:00",null,0,0,0,0,0,0,0,0,0,0,0,0,0,0,0,0,0,0,0,0,0,0,0,0,0,0,0,0,0,0,0,0,0,0,0,0,0,0,0,0,0,0,0,0,0,0,5,0,0,0,0,0,0,0,0,0,0,0,0,5,0,0,5,5,0,5,0,5,0,0,0,0,0,0]
["Liverpool",2,1,"West Brom","15:00:00",null,5,5,10,10,0,5,10,5,5,10,0,10,5,5,5,5,10,10,5,5,10,5,10,5,5,10,10,5,5,5,5,5,10,5,5,5,5,0,5,10,10,10,10,5,5,0,5,5,5,5,0,5,5,5,10,5,5,10,0,10,5,5,5,5,5,5,5,10,10,10,5,5,10,10]
["Sunderland",3,1,"Stoke City","15:00:00",null,0,0,0,5,5,5,0,5,0,0,0,0,5,5,5,5,0,0,5,5,0,0,0,0,5,0,5,0,5,5,5,5,0,0,5,0,0,5,0,0,5,0,0,0,5,0,0,0,0,0,5,0,5,5,0,0,5,0,0,0,5,0,0,5,0,5,5,0,0,0,0,0,5,0]
["Swansea City",2,2,"Newcastle United","15:00:00",null,5,0,0,0,5,0,0,5,0,0,0,10,5,0,0,0,10,0,0,0,0,0,0,10,0,0,0,0,10,0,10,0,0,0,5,10,0,0,0,0,0,0,0,0,0,0,0,0,0,0,10,5,10,0,0,0,0,0,0,0,0,10,5,0,0,0,0,0,0,0,0,0,0,0]
["Aston Villa",0,2,"Man City","17:30:00",null,5,10,5,5,10,5,5,10,0,10,5,5,10,5,5,10,5,10,10,10,10,5,5,5,5,5,5,10,10,5,5,10,5,5,5,5,5,5,5,5,5,10,5,5,0,5,5,10,10,10,5,5,5,10,5,10,5,10,5,5,10,5,5,5,5,5,10,5,5,5,5,5,0,10]
[]
["Sunday, October 5th"]
["Man United",2,1,"Everton","12:00:00",null,10,0,5,0,0,5,5,0,5,10,5,0,5,10,5,0,10,0,10,0,5,10,10,5,5,0,0,10,5,0,5,10,5,0,0,0,10,0,5,5,10,5,5,5,5,5,0,0,10,10,5,0,10,10,0,10,5,5,5,5,5,10,0,0,5,0,0,10,5,5,5,10,10,0]
["Chelsea",2,0,"Arsenal","14:05:00",null,5,0,5,5,5,5,5,5,0,5,0,0,5,0,5,10,10,5,0,5,0,10,5,5,5,10,5,10,5,10,0,5,10,0,10,5,5,5,10,5,5,5,5,5,10,5,0,5,0,10,0,5,5,5,5,5,5,5,0,10,0,5,0,0,5,0,0,5,10,10,5,10,5,5]
["Tottenham",1,0,"Southampton","14:05:00",null,5,10,0,0,5,10,0,0,0,0,5,5,5,5,0,10,0,5,0,10,0,0,5,10,0,0,0,0,5,0,0,5,0,0,0,0,5,0,0,5,10,0,5,0,5,5,0,0,10,0,0,0,0,0,0,0,0,0,5,0,0,5,5,10,0,0,0,0,0,0,5,0,5,0]
["West Ham",2,0,"QPR","16:15:00",null,5,10,5,10,5,5,10,5,5,5,0,0,5,5,5,0,10,5,10,10,10,5,5,5,0,5,10,10,5,10,5,10,5,5,10,0,10,5,5,10,10,5,10,5,5,0,10,0,5,5,5,10,10,10,10,10,10,5,5,5,10,0,0,5,5,10,5,0,10,10,5,10,5,5]
[]
["Saturday, October 18th"]
["Man City",4,1,"Tottenham","12:45:00",null,5,5,5,5,0,5,5,5,5,5,5,5,5,5,5,5,5,5,5,5,5,5,5,5,5,5,5,5,5,5,5,5,5,5,5,5,5,5,5,5,5,5,5,5,5,5,5,5,5,5,5,5,5,5,5,5,5,5,5,5,5,5,5,5,5,5,5,5,5,5,10,"-",5,5]
["Arsenal",2,2,"Hull City","15:00:00",null,0,0,0,0,0,0,0,0,0,0,0,0,0,0,0,0,0,0,0,0,0,0,0,0,0,0,0,0,0,0,0,0,0,0,0,0,0,0,0,0,0,0,0,0,0,0,0,5,0,0,0,0,0,0,0,0,0,0,0,0,0,0,0,0,0,0,0,0,0,0,0,"-",0,0]
["Burnley",1,3,"West Ham","15:00:00",null,5,0,5,0,0,0,0,5,0,0,0,0,0,0,0,0,0,0,5,5,5,0,0,0,5,5,5,0,0,5,0,0,5,0,5,5,0,0,5,0,0,0,0,5,0,0,5,0,0,0,0,0,0,0,0,5,5,5,0,5,0,0,0,5,5,0,5,0,0,0,0,"-",0,5]
["Crystal Palace",1,2,"Chelsea","15:00:00",null,5,0,5,5,5,10,5,5,10,5,5,5,10,10,5,0,5,5,5,5,5,5,10,5,10,5,5,5,5,5,5,5,10,5,5,5,5,5,10,5,10,5,5,5,0,10,10,5,10,5,5,5,0,0,5,5,5,5,5,5,0,10,0,5,5,10,5,5,5,5,5,"-",5,10]
["Everton",3,0,"Aston Villa","15:00:00",null,0,5,5,0,5,5,5,5,0,5,5,5,5,5,10,5,5,5,5,5,5,5,5,5,5,0,0,5,5,5,0,5,5,5,5,5,0,5,5,0,5,0,0,5,5,0,0,5,0,5,5,0,5,5,5,0,5,5,5,5,5,5,5,5,0,5,5,5,5,0,0,"-",5,0]
["Newcastle United",1,0,"Leicester City","15:00:00",null,10,5,5,0,10,5,5,0,0,5,0,0,5,5,0,5,0,10,10,0,0,0,0,5,10,0,0,10,5,5,5,10,5,5,0,5,5,0,10,5,10,5,5,5,10,0,0,0,10,0,5,0,5,5,10,5,5,5,0,5,10,0,5,0,0,10,10,10,5,10,5,"-",0,5]
["Southampton",8,0,"Sunderland","15:00:00",null,5,5,5,5,0,5,5,5,5,5,5,0,0,5,5,5,5,5,5,5,5,0,5,5,5,5,5,5,0,5,5,5,5,5,5,5,5,5,5,5,5,5,0,5,5,5,5,5,5,5,5,5,5,5,5,5,5,5,5,0,5,5,5,0,0,5,5,5,5,5,5,"-",5,0]
[]
["Sunday, October 19th"]
["QPR",2,3,"Liverpool","13:30:00",null,5,0,0,5,0,5,5,5,5,5,5,5,5,5,5,5,0,5,5,5,5,5,5,5,5,5,5,5,5,5,5,5,5,5,5,5,5,5,5,5,5,5,5,5,0,0,5,5,5,0,0,5,5,0,5,5,5,5,0,5,0,5,0,5,0,5,5,5,5,0,5,"-",5,0]
["Stoke City",2,1,"Swansea City","14:05:00",null,5,5,0,0,5,10,10,5,0,0,0,0,10,0,5,5,0,5,10,0,0,0,0,0,0,10,0,0,10,0,0,10,10,0,0,0,10,0,10,10,5,5,10,0,5,5,0,0,0,10,5,0,0,10,0,0,0,0,0,10,5,5,10,5,0,0,5,5,10,5,0,"-",0,10]
[]
["Monday, October 20th"]
["West Brom",2,2,"Man United","20:00:00",null,0,0,0,0,10,0,0,0,0,0,0,0,0,0,0,5,0,0,0,0,0,0,0,0,0,0,0,0,0,0,0,0,5,0,0,0,0,5,0,5,0,0,0,0,0,0,0,10,0,0,0,0,0,0,10,0,0,0,0,0,0,0,0,0,0,0,0,0,0,0,0,"-",0,0]
[]
["Saturday, October 25th"]
["West Ham",2,1,"Man City","12:45:00",null,0,0,0,0,0,0,0,0,0,0,0,0,0,10,0,0,0,0,0,0,0,0,0,0,5,0,0,0,0,5,10,0,0,0,0,0,0,0,0,0,0,0,0,0,5,0,10,10,0,0,5,0,0,0,10,0,0,0,0,0,0,0,0,0,5,0,0,0,0,0,0,0,10,0]
["Liverpool",0,0,"Hull City","15:00:00",null,0,0,5,0,10,0,0,0,0,0,0,5,0,0,0,0,5,0,0,0,0,5,0,0,0,5,0,5,0,0,0,0,0,0,0,0,0,10,0,0,0,0,0,0,0,5,0,0,0,0,0,0,0,0,0,0,5,0,0,0,0,0,0,0,0,0,0,5,0,10,0,0,0,0]
["Southampton",1,0,"Stoke City","15:00:00",null,5,0,5,5,5,5,10,5,5,5,10,5,5,5,10,5,0,5,5,5,5,0,5,5,5,5,5,5,5,5,5,5,5,5,5,5,5,5,10,5,10,5,0,5,5,5,5,5,5,5,5,5,10,5,0,5,5,5,0,0,5,0,0,10,5,5,5,0,5,5,5,10,5,5]
["Sunderland",0,2,"Arsenal","15:00:00",null,5,5,5,5,5,5,0,10,5,5,5,10,0,10,5,0,0,10,5,5,10,0,5,5,0,5,5,5,5,0,5,10,5,5,10,5,5,10,5,5,10,5,0,5,5,5,0,0,5,5,0,10,0,5,5,5,5,5,5,5,10,5,5,5,0,0,5,5,5,5,5,10,0,0]
["West Brom",2,2,"Crystal Palace","15:00:00",null,5,0,5,0,0,10,0,0,0,0,0,5,0,0,0,5,5,5,0,0,0,0,0,5,0,0,0,0,0,0,0,0,0,0,10,5,0,5,0,0,0,5,0,0,0,5,0,0,5,0,0,0,0,0,0,0,10,0,0,5,0,0,0,5,0,10,0,0,0,0,0,5,0,5]
["Swansea City",2,0,"Leicester City","17:30:00",null,10,5,5,10,0,5,10,5,5,5,10,10,10,5,0,5,0,10,10,5,5,0,10,10,10,0,5,5,10,5,5,5,5,10,5,0,5,0,5,10,5,0,10,5,5,5,5,5,5,5,10,5,5,5,10,5,5,5,0,5,5,5,0,5,10,5,0,0,5,5,0,0,5,5]
[]
["Sunday, October 26th"]
["Burnley",1,3,"Everton","13:30:00",null,10,5,10,5,0,10,5,5,5,5,0,10,0,5,0,5,0,5,5,5,5,0,5,5,0,5,5,5,5,5,0,5,5,5,5,10,5,5,5,5,5,5,0,5,5,5,0,10,5,5,0,5,10,5,5,5,5,5,5,5,5,10,0,5,0,5,5,5,5,10,10,5,0,5]
["Tottenham",1,2,"Newcastle United","13:30:00",null,0,0,0,0,0,0,0,0,0,0,0,0,0,0,0,0,0,0,0,0,0,0,0,0,0,0,0,0,0,0,0,0,0,0,0,0,0,0,0,0,0,0,0,0,0,0,0,0,0,0,0,0,0,0,0,0,10,0,0,0,0,0,0,0,0,0,0,0,0,0,0,0,0,0]
["Man United",1,1,"Chelsea","16:00:00",null,5,0,0,0,0,10,0,0,0,0,0,0,0,0,0,10,10,0,5,0,0,5,5,10,0,0,0,10,0,0,5,0,0,0,0,0,0,0,0,0,0,10,0,5,0,0,0,0,0,0,0,0,0,0,5,0,0,0,0,0,0,0,5,0,0,0,0,0,0,10,0,0,0,0]
[]
["Monday, October 27th"]
["QPR",2,0,"Aston Villa","20:00:00",null,0,0,0,0,0,5,5,5,0,0,0,0,0,0,0,5,0,0,0,5,0,0,0,0,10,10,0,0,0,5,0,0,0,10,5,0,0,10,5,0,0,5,0,5,0,0,5,0,0,5,10,0,0,0,5,5,5,0,0,5,0,5,0,5,10,0,5,0,0,5,0,0,5,5]
[]
["Golden Boots"]
["Alexis Sanchez - Arsenal",null,null,null,{"$f":"0+1+2","v":3},{"$f":"COUNT(G49:CB49)","v":14},null,{"$f":"5*$E49","v":15},null,null,null,null,null,{"$f":"5*$E49","v":15},null,null,null,null,null,{"$f":"5*$E49","v":15},null,null,null,null,{"$f":"5*$E49","v":15},{"$f":"5*$E49","v":15},null,null,{"$f":"5*$E49","v":15},null,null,null,null,null,null,null,null,null,null,null,null,null,{"$f":"5*$E49","v":15},null,{"$f":"5*$E49","v":15},null,null,null,null,null,null,{"$f":"5*$E49","v":15},null,null,null,null,null,{"$f":"5*$E49","v":15},null,null,null,null,{"$f":"5*$E49","v":15},{"$f":"5*$E49","v":15},null,null,null,null,null,null,null,null,null,{"$f":"5*$E49","v":15},null,null,null,{"$f":"5*$E49","v":15}]
["Daniel Sturridge - Liverpool",null,null,null,{"$f":"0+0+0","v":0},52,{"$f":"5*$E50","v":0},null,{"$f":"5*$E50","v":0},{"$f":"5*$E50","v":0},{"$f":"5*$E50","v":0},null,{"$f":"5*$E50","v":0},{"$f":"5*$E50","v":0},{"$f":"5*$E50","v":0},{"$f":"5*$E50","v":0},{"$f":"5*$E50","v":0},{"$f":"5*$E50","v":0},{"$f":"5*$E50","v":0},null,null,{"$f":"5*$E50","v":0},{"$f":"5*$E50","v":0},{"$f":"5*$E50","v":0},null,{"$f":"5*$E50","v":0},{"$f":"5*$E50","v":0},{"$f":"5*$E50","v":0},null,null,{"$f":"5*$E50","v":0},{"$f":"5*$E50","v":0},{"$f":"5*$E50","v":0},null,{"$f":"5*$E50","v":0},0,0,0,0,null,0,0,null,{"$f":"5*$E50","v":0},{"$f":"5*$E50","v":0},null,{"$f":"5*$E50","v":0},{"$f":"5*$E50","v":0},null,{"$f":"5*$E50","v":0},{"$f":"5*$E50","v":0},null,{"$f":"5*$E50","v":0},{"$f":"5*$E50","v":0},{"$f":"5*$E50","v":0},{"$f":"5*$E50","v":0},{"$f":"5*$E50","v":0},{"$f":"5*$E50","v":0},null,null,{"$f":"5*$E50","v":0},{"$f":"5*$E50","v":0},{"$f":"5*$E50","v":0},0,{"$f":"5*$E50","v":0},null,null,null,{"$f":"5*$E50","v":0},null,{"$f":"5*$E50","v":0},{"$f":"5*$E50","v":0},{"$f":"5*$E50","v":0},null,{"$f":"5*$E50","v":0},{"$f":"5*$E50","v":0},null,null,{"$f":"5*$E50","v":0},{"$f":"5*$E50","v":0}]
["Diego Costa - Chelsea",null,null,null,{"$f":"1+0+0","v":1},39,null,{"$f":"5*$E51","v":5},null,5,null,{"$f":"5*$E51","v":5},{"$f":"5*$E51","v":5},null,5,{"$f":"5*$E51","v":5},null,null,{"$f":"5*$E51","v":5},{"$f":"5*$E51","v":5},null,null,null,null,null,{"$f":"5*$E51","v":5},null,{"$f":"5*$E51","v":5},{"$f":"5*$E51","v":5},null,5,{"$f":"5*$E51","v":5},{"$f":"5*$E51","v":5},{"$f":"5*$E51","v":5},null,{"$f":"5*$E51","v":5},{"$f":"5*$E51","v":5},null,null,null,{"$f":"5*$E51","v":5},{"$f":"5*$E51","v":5},null,{"$f":"5*$E51","v":5},null,{"$f":"5*$E51","v":5},5,{"$f":"5*$E51","v":5},{"$f":"5*$E51","v":5},null,null,{"$f":"5*$E51","v":5},{"$f":"5*$E51","v":5},{"$f":"5*$E51","v":5},null,{"$f":"5*$E51","v":5},null,{"$f":"5*$E51","v":5},{"$f":"5*$E51","v":5},{"$f":"5*$E51","v":5},{"$f":"5*$E51","v":5},null,null,null,null,{"$f":"5*$E51","v":5},{"$f":"5*$E51","v":5},{"$f":"5*$E51","v":5},null,{"$f":"5*$E51","v":5},null,null,null,null,null,null,null,{"$f":"5*$E51","v":5},{"$f":"5*$E51","v":5},5]
["Eden Hazard - Chelsea",null,null,null,{"$f":"1+0+0","v":1},2,null,null,null,null,{"$f":"5*$E52","v":5},null,null,null,null,null,null,null,null,null,null,null,null,null,null,null,null,null,null,null,null,null,null,null,null,null,null,null,null,null,null,null,null,null,null,null,null,null,null,null,null,null,null,null,null,null,null,null,null,null,null,null,null,null,null,null,null,null,null,null,null,null,null,null,null,{"$f":"5*$E52","v":5}]
["Edin Dzeko - Man City",null,null,null,{"$f":"0+0+0","v":0},6,null,null,null,null,null,{"$f":"5*$E53","v":0},null,null,null,null,null,null,null,null,null,null,null,null,null,null,null,{"$f":"5*$E53","v":0},null,null,null,null,null,null,null,null,null,null,null,null,null,null,{"$f":"5*$E53","v":0},null,null,{"$f":"5*$E53","v":0},null,null,null,null,null,null,null,null,null,null,null,null,null,null,null,null,null,null,null,null,null,{"$f":"5*$E53","v":0},null,null,null,null,null,{"$f":"5*$E53","v":0}]
["Emmanuel Adebayor - Tottenham",null,null,null,{"$f":"0+0+1","v":1},3,null,null,null,null,null,null,null,null,null,null,null,null,null,null,{"$f":"5*$E54","v":5},null,null,null,null,null,null,null,null,null,null,null,null,null,null,null,null,null,null,{"$f":"5*$E54","v":5},null,null,null,null,null,null,null,null,null,null,null,null,null,null,null,null,null,null,null,null,null,null,null,null,null,null,null,null,null,null,{"$f":"5*$E54","v":5}]
["Olivier Giroud - Arsenal",null,null,null,{"$f":"0+0+0","v":0},4,null,null,null,null,null,{"$f":"5*$E55","v":0},null,null,null,null,null,null,null,null,null,null,null,null,null,null,null,null,null,{"$f":"5*$E55","v":0},null,null,null,null,null,null,null,null,null,0,null,null,null,null,null,null,null,{"$f":"5*$E55","v":0}]
["Raheem Sterling - Liverpool",null,null,null,{"$f":"0+0+0","v":0},3,null,null,null,null,null,null,null,null,null,null,null,null,null,null,null,null,null,null,null,null,null,null,null,null,null,null,null,null,null,null,null,null,null,null,null,null,null,null,null,{"$f":"5*$E56","v":0},null,null,null,null,null,null,null,null,null,null,null,null,null,null,null,null,null,null,null,null,null,null,{"$f":"5*$E56","v":0},null,null,null,{"$f":"5*$E56","v":0}]
["Robin van Persie - Man United",null,null,null,{"$f":"0+0+1","v":1},45,{"$f":"5*$E57","v":5},{"$f":"5*$E57","v":5},null,{"$f":"5*$E57","v":5},null,null,null,null,null,{"$f":"5*$E57","v":5},{"$f":"5*$E57","v":5},{"$f":"5*$E57","v":5},{"$f":"5*$E57","v":5},null,{"$f":"5*$E57","v":5},{"$f":"5*$E57","v":5},null,{"$f":"5*$E57","v":5},{"$f":"5*$E57","v":5},null,{"$f":"5*$E57","v":5},null,null,{"$f":"5*$E57","v":5},null,{"$f":"5*$E57","v":5},{"$f":"5*$E57","v":5},{"$f":"5*$E57","v":5},{"$f":"5*$E57","v":5},{"$f":"5*$E57","v":5},null,{"$f":"5*$E57","v":5},{"$f":"5*$E57","v":5},null,null,{"$f":"5*$E57","v":5},{"$f":"5*$E57","v":5},{"$f":"5*$E57","v":5},null,null,{"$f":"5*$E57","v":5},null,{"$f":"5*$E57","v":5},{"$f":"5*$E57","v":5},{"$f":"5*$E57","v":5},null,{"$f":"5*$E57","v":5},{"$f":"5*$E57","v":5},{"$f":"5*$E57","v":5},{"$f":"5*$E57","v":5},{"$f":"5*$E57","v":5},null,{"$f":"5*$E57","v":5},{"$f":"5*$E57","v":5},{"$f":"5*$E57","v":5},{"$f":"5*$E57","v":5},null,null,{"$f":"5*$E57","v":5},{"$f":"5*$E57","v":5},{"$f":"5*$E57","v":5},{"$f":"5*$E57","v":5},null,{"$f":"5*$E57","v":5},null,{"$f":"5*$E57","v":5},null,null,null,{"$f":"5*$E57","v":5},{"$f":"5*$E57","v":5},null,{"$f":"5*$E57","v":5}]
["Romelu Lukaku - Everton",null,null,null,{"$f":"0+1+1","v":2},7,{"$f":"5*$E58","v":10},null,{"$f":"5*$E58","v":10},null,null,null,null,null,null,null,null,null,null,{"$f":"5*$E58","v":10},{"$f":"5*$E58","v":10},null,null,null,null,null,null,null,null,null,null,null,null,null,null,null,null,null,null,null,null,null,null,null,null,null,null,null,null,{"$f":"5*$E58","v":10},null,null,null,null,null,null,null,null,null,null,null,null,null,null,null,null,null,null,null,null,null,null,null,null,null,null,{"$f":"5*$E58","v":10},{"$f":"5*$E58","v":10}]
["Sergio Aguero - Man City",null,null,null,{"$f":"1+4+0","v":5},21,null,null,null,null,null,null,{"$f":"5*$E59","v":25},{"$f":"5*$E59","v":25},null,null,{"$f":"5*$E59","v":25},{"$f":"5*$E59","v":25},null,null,null,null,{"$f":"5*$E59","v":25},{"$f":"5*$E59","v":25},{"$f":"5*$E59","v":25},null,null,null,{"$f":"5*$E59","v":25},{"$f":"5*$E59","v":25},null,null,null,null,{"$f":"5*$E59","v":25},null,{"$f":"5*$E59","v":25},{"$f":"5*$E59","v":25},{"$f":"5*$E59","v":25},{"$f":"5*$E59","v":25},{"$f":"5*$E59","v":25},null,null,null,null,null,null,null,null,null,{"$f":"5*$E59","v":25},null,null,null,{"$f":"5*$E59","v":25},null,null,null,{"$f":"5*$E59","v":25},null,null,{"$f":"5*$E59","v":25},null,null,null,null,{"$f":"5*$E59","v":25},null,null,null,null,null,null,null,{"$f":"5*$E59","v":25}]
["Steven Gerrard - Liverpool",null,null,null,{"$f":"0+0+0","v":0},1,null,null,null,null,null,null,null,null,null,null,null,null,null,null,null,null,null,null,null,null,null,null,null,null,null,null,null,null,null,null,null,null,null,null,null,null,null,null,null,null,null,null,null,null,null,null,null,null,null,null,null,null,null,null,null,null,null,null,null,null,null,null,{"$f":"5*$E60","v":0}]
["Wayne Rooney - Man United",null,null,null,{"$f":"0+0+0","v":0},21,null,null,{"$f":"5*$E61","v":0},null,{"$f":"5*$E61","v":0},null,null,null,{"$f":"5*$E61","v":0},null,null,null,null,null,null,{"$f":"5*$E61","v":0},{"$f":"5*$E61","v":0},null,null,null,{"$f":"5*$E61","v":0},null,null,null,null,null,null,null,null,null,null,null,null,null,null,null,null,null,{"$f":"5*$E61","v":0},null,null,null,{"$f":"5*$E61","v":0},null,null,{"$f":"5*$E61","v":0},null,null,null,null,{"$f":"5*$E61","v":0},null,null,{"$f":"5*$E61","v":0},null,null,{"$f":"5*$E61","v":0},{"$f":"5*$E61","v":0},{"$f":"5*$E61","v":0},{"$f":"5*$E61","v":0},null,null,null,null,{"$f":"5*$E61","v":0},null,{"$f":"5*$E61","v":0},{"$f":"5*$E61","v":0},{"$f":"5*$E61","v":0},null,{"$f":"5*$E61","v":0},null,null,{"$f":"5*$E61","v":0}]
["Wilfried Bony - Swansea City",null,null,null,{"$f":"1+1+2","v":4},1,null,null,null,null,null,null,null,null,null,null,null,null,null,null,null,null,null,null,null,null,null,null,null,null,null,null,null,{"$f":"5*$E62","v":20}]
["Yaya Toure - Man City",null,null,null,{"$f":"1+0+0","v":1},3,null,null,null,null,null,null,null,null,null,null,null,null,null,null,null,null,null,null,null,null,null,null,null,null,{"$f":"5*$E63","v":5},null,null,null,null,null,null,null,null,null,null,null,null,null,null,null,null,null,null,null,null,null,null,null,null,null,null,null,null,null,null,null,null,null,null,null,null,null,null,{"$f":"5*$E63","v":5},null,{"$f":"5*$E63","v":5}]
[]
[]
["Sack Race"]
["Alan Irvine - West Brom",null,null,null,null,{"$f":"COUNT(G67:CB67)","v":5},null,null,null,null,null,null,{"$f":"25*$E67","v":0},null,null,null,null,null,{"$f":"25*$E67","v":0},null,null,null,null,null,null,null,null,null,null,null,null,null,{"$f":"25*$E67","v":0},null,null,null,null,null,null,null,null,null,null,null,null,null,null,null,null,null,null,null,null,null,null,null,null,null,null,null,null,null,{"$f":"25*$E67","v":0},null,null,null,null,null,null,null,null,null,{"$f":"25*$E67","v":0}]
["Alan Pardew - Newcastle",null,null,null,null,8,{"$f":"25*$E68","v":0},null,null,null,{"$f":"25*$E68","v":0},null,null,null,null,null,null,null,null,null,{"$f":"25*$E68","v":0},{"$f":"25*$E68","v":0},null,null,null,null,null,null,null,null,null,null,null,null,null,null,{"$f":"25*$E68","v":0},null,null,null,null,null,null,null,null,null,null,null,null,null,{"$f":"25*$E68","v":0},null,null,null,null,null,null,null,null,null,null,null,null,null,null,null,{"$f":"25*$E68","v":0},null,null,null,null,null,null,null,null,null,null,null,null,{"$f":"25*$E68","v":0}]
["Arsene Wenger - Arsenal",null,null,null,null,0]
["Brendan Rodgers - Liverpool",null,null,null,null,0]
["Garry Monk - Swansea City",null,null,null,null,6,null,null,null,null,null,null,null,null,null,null,null,null,null,null,null,null,null,null,null,null,{"$f":"25*$E71","v":0},{"$f":"25*$E71","v":0},null,null,null,null,null,null,null,null,null,null,null,null,null,null,null,null,null,null,null,null,{"$f":"25*$E71","v":0},null,null,null,{"$f":"25*$E71","v":0},null,{"$f":"25*$E71","v":0},null,null,null,null,null,null,null,null,{"$f":"25*$E71","v":0}]
["Gus Poyet - Sunderland",null,null,null,null,0]
["Harry Redknapp - QPR",null,null,null,null,2,null,null,null,null,null,null,null,null,null,null,null,null,null,null,null,null,null,null,null,null,null,null,null,null,null,null,null,null,null,null,null,null,null,{"$f":"25*$E73","v":0},null,null,null,null,null,null,null,null,null,null,null,null,null,null,null,null,null,null,null,null,null,null,null,null,null,null,null,null,null,{"$f":"25*$E73","v":0}]
["Jose Mourinho - Chelsea",null,null,null,null,0]
["Louis van Gaal - Man United",null,null,null,null,1,null,null,null,null,null,null,null,null,null,null,null,null,null,null,null,null,null,null,null,null,null,null,null,null,null,null,null,null,null,null,null,null,null,null,null,null,null,null,null,null,null,null,null,null,null,null,null,null,null,null,null,null,null,null,null,null,null,null,null,null,null,null,{"$f":"25*$E75","v":0}]
["Manuel Pellegrini - Man City",null,null,null,null,0]
["Mark Hughes - Stoke City",null,null,null,null,0]
["Mauricio Pochettino - Tottenham",null,null,null,null,0]
["Nigel Pearson - Leicester City",null,null,null,null,3,null,null,null,null,null,{"$f":"25*$E79","v":0},null,null,null,null,null,null,null,null,null,null,null,null,null,null,null,null,null,null,null,{"$f":"25*$E79","v":0},null,null,null,{"$f":"25*$E79","v":0}]
["Paul Lambert - Aston Villa",null,null,null,null,13,null,null,null,null,null,null,null,null,null,null,null,null,null,{"$f":"25*$E80","v":0},null,null,null,null,{"$f":"25*$E80","v":0},{"$f":"25*$E80","v":0},null,null,null,{"$f":"25*$E80","v":0},{"$f":"25*$E80","v":0},null,null,null,null,null,null,{"$f":"25*$E80","v":0},{"$f":"25*$E80","v":0},null,null,null,null,null,{"$f":"25*$E80","v":0},{"$f":"25*$E80","v":0},null,{"$f":"25*$E80","v":0},null,{"$f":"25*$E80","v":0},null,null,null,{"$f":"25*$E80","v":0},null,null,null,null,null,null,null,null,null,null,{"$f":"25*$E80","v":0}]
["Roberto Martinez - Everton",null,null,null,null,0]
["Ronald Koeman - Southampton",null,null,null,null,4,null,null,null,null,null,null,null,null,null,null,null,{"$f":"25*$E82","v":0},null,null,null,null,null,null,null,null,null,null,null,null,null,null,null,null,null,null,null,null,null,null,null,{"$f":"25*$E82","v":0},null,null,null,null,null,null,null,null,null,null,null,null,null,null,null,null,null,null,null,null,null,null,null,null,null,{"$f":"25*$E82","v":0},null,null,null,null,null,{"$f":"25*$E82","v":0}]
["Sam Allardyce - West Ham",null,null,null,null,27,null,null,{"$f":"25*$E83","v":0},{"$f":"25*$E83","v":0},null,null,null,{"$f":"25*$E83","v":0},{"$f":"25*$E83","v":0},{"$f":"25*$E83","v":0},{"$f":"25*$E83","v":0},null,null,null,null,null,{"$f":"25*$E83","v":0},{"$f":"25*$E83","v":0},null,null,null,null,{"$f":"25*$E83","v":0},null,null,null,null,{"$f":"25*$E83","v":0},{"$f":"25*$E83","v":0},null,null,null,null,null,{"$f":"25*$E83","v":0},null,{"$f":"25*$E83","v":0},{"$f":"25*$E83","v":0},null,null,{"$f":"25*$E83","v":0},null,null,null,null,{"$f":"25*$E83","v":0},null,null,null,{"$f":"25*$E83","v":0},{"$f":"25*$E83","v":0},null,null,{"$f":"25*$E83","v":0},{"$f":"25*$E83","v":0},null,null,null,null,{"$f":"25*$E83","v":0},null,null,null,null,{"$f":"25*$E83","v":0},{"$f":"25*$E83","v":0},null,null,{"$f":"25*$E83","v":0},{"$f":"25*$E83","v":0},{"$f":"25*$E83","v":0},null,{"$f":"25*$E83","v":0}]
["Sean Dyche - Burnley",null,null,null,null,4,null,{"$f":"25*$E84","v":0},null,null,null,null,null,null,null,null,null,null,null,null,null,null,null,null,null,null,null,null,null,null,null,null,null,null,null,null,null,null,null,null,null,null,null,null,null,null,null,null,null,null,null,null,null,null,null,null,null,{"$f":"25*$E84","v":0},{"$f":"25*$E84","v":0},null,null,{"$f":"25*$E84","v":0}]
["Steve Bruce - Hull City",null,null,null,null,1,null,null,null,null,null,null,null,null,null,null,null,null,null,null,null,null,null,null,null,null,null,null,null,null,null,null,null,null,null,null,null,null,null,null,null,null,null,null,null,null,null,null,null,null,null,null,null,null,null,null,null,null,null,null,null,null,null,null,null,null,null,null,null,null,null,null,null,null,null,null,null,{"$f":"25*$E85","v":0}]
[]
["Total Points - October",null,null,null,null,null,{"$f":"SUM(G2:G86)","v":140},{"$f":"SUM(H2:H86)","v":105},105,90,105,145,135,145,70,100,105,125,115,140,100,115,120,140,170,120,100,70,150,155,115,105,95,150,145,105,130,155,140,110,140,95,120,105,135,115,145,105,95,110,125,100,90,100,130,105,100,100,140,110,130,130,135,110,65,120,130,115,65,115,75,{"$f":"SUM(BT2:BT86)","v":105},95,110,130,135,95,100,105,100]
[]
[null,null,null,null,null,null,{"$f":"IF(COUNT(G48:G86)=4,\"a\",\"g\")","v":"a"},"a","a","a","a","a","a","a","a","a","a","a","a","a","a","a","a","a","a","a","a","a","a","a","a","a","a","a","a","a","a","a","a","a","a","a","a","a","a","a","a","a","a","a","a","a","a","a","a","a","a","a","a","a","a","a","a","a","a","a","a","a","a","a",{"$f":"IF(COUNT(BS48:BS86)=4,\"a\",\"g\")","v":"a"},"a","a","a","a","a","a","a","a","a"]

{"sheet":"November","index":4,"n_rows":104,"n_cols":80,"rows_kept":104,"cut":false,"hidden":false,"merged":[[1,0,1,4],[10,0,10,4],[14,0,14,4],[17,0,17,4],[25,0,25,4],[31,0,31,4],[40,0,40,4],[44,0,44,4],[47,0,47,4],[57,0,57,4]]}
[null,null,null,null,null,null,"Aaron Byrne","Aidan Knight","Aidan Scanlon","Aidan White","Aiden Desch","Alan Boyle","Anastas Popov","Andy Dunne","Anthony Hughes","Barry Healy","Brendan Maguire","Brian Mullen","Brian Prendergast","Brian Sotolongo","Chris Hall","Ciaran O'Hart","Cillian Conway","Colin McAnaspie","Con McSweeney","Conor Horan","Craig Calvert","Dave Green","Dave McGinley","David Bone","David Byrne","David Cooney","David Keavney","Eamon Fox","Fiachra Moynihan","Gareth Pierpoint","Gary McGurk","Gavin Morgan","Gerry Draper","Gerry Moore","Ian Healy","Javier Suarez Barreiro","Jenny Ellis","Joe Behan","Joe O'Hehir","Joe Turner","Jonathan Fox","Keith Horan","Kevin Donohoe","Kevin Philpott","Konstantin Kulev","Kris Stainton","Liam Butler","Liam Geraghty","Maria Jordan","Mike Hall","Niall Carroll","Oisin O'Reilly","Padraic Carney","Pat Jordan","Paul Moore","Paul Prendergast","Paul Stainton","Peter Behan","Phil Doyle","Philip Jordan","Ralph Goodwin","Ray Ellis","Rhona Devlin","Richard Johnston","Sean Moloney","Sean O'Mairtin","Shane Horan","Sharon Behan","Simon Purdue","Siobhan Murphy","Terry Behan","Tiago Moreira","Tom McHugh","Wayne Donovan"]
["Saturday, November 1st"]
["Newcastle United",1,0,"Liverpool","12:45:00",null,0,0,0,0,5,5,5,0,5,0,5,5,0,5,0,10,0,0,0,0,0,0,0,0,5,5,0,0,0,0,0,5,0,0,5,0,0,0,0,0,0,0,0,5,10,0,0,5,0,10,5,0,5,0,0,0,5,5,5,5,0,0,0,10,5,0,0,0,0,10,5,"-",5,5]
["Arsenal",3,0,"Burnley","15:00:00",null,5,10,5,5,5,10,5,10,10,10,10,5,10,5,5,10,5,10,10,10,10,5,10,5,5,5,10,5,10,5,5,10,5,10,5,10,5,10,10,5,5,5,10,10,5,5,10,5,5,5,5,5,10,5,10,10,5,5,10,5,5,5,5,5,5,10,10,5,10,5,10,"-",5,10]
["Chelsea",2,1,"QPR","15:00:00",null,5,5,5,5,10,5,5,5,5,5,5,5,5,5,5,5,5,5,5,5,5,5,5,5,5,5,5,5,5,5,5,5,5,5,5,5,5,5,5,5,5,5,5,5,5,5,5,5,5,5,5,5,5,5,5,5,5,5,5,5,5,5,0,10,5,5,5,5,5,5,5,"-",10,5]
["Everton",0,0,"Swansea City","15:00:00",null,0,0,0,0,0,0,0,0,0,5,0,5,0,0,0,0,0,0,0,0,5,5,0,0,0,0,0,0,0,0,0,0,0,5,0,0,0,5,0,0,0,5,0,0,5,0,0,0,5,0,0,0,0,5,0,0,0,0,5,0,0,0,5,0,0,0,0,0,0,0,0,"-",0,0]
["Hull City",0,1,"Southampton","15:00:00",null,5,5,5,0,0,5,0,5,5,5,0,10,0,0,0,0,0,10,0,10,5,0,0,0,0,0,5,0,0,0,0,5,0,0,0,0,5,0,0,0,10,5,0,0,10,5,5,0,0,0,0,5,0,5,0,10,0,0,5,0,10,0,10,0,0,0,5,0,5,5,0,"-",0,0]
["Leicester City",0,1,"West Brom","15:00:00",null,5,0,0,0,0,0,0,0,5,0,0,0,0,0,0,0,0,5,0,0,0,0,0,5,0,0,0,0,0,5,0,0,5,0,0,5,0,0,0,0,0,0,0,5,0,0,0,5,0,0,0,0,0,0,0,5,0,0,5,0,0,0,10,0,0,0,0,10,0,5,0,"-",0,0]
["Stoke City",2,2,"West Ham United","15:00:00",null,10,0,5,10,0,5,0,0,5,0,0,0,0,10,0,0,0,10,0,0,0,10,5,5,0,0,0,0,0,5,10,0,10,5,0,0,0,5,0,0,5,0,0,5,5,0,5,0,0,5,0,0,0,0,10,5,0,0,10,0,0,0,0,0,0,0,0,0,0,5,5,"-",0,5]
[]
["Sunday, November 2nd"]
["Man City",1,0,"Man United","13:30:00",null,5,5,0,5,5,0,5,5,0,5,0,5,5,5,5,5,0,0,5,5,0,5,0,5,5,5,5,5,5,5,5,5,5,0,5,5,5,5,0,5,5,0,5,5,5,0,5,0,0,5,0,0,5,0,5,5,5,5,0,0,5,5,0,5,5,0,5,5,0,0,0,"-",5,5]
["Aston Villa",1,2,"Tottenham","16:00:00",null,0,10,10,10,0,0,0,0,5,5,0,0,0,10,0,5,0,0,0,5,0,10,0,10,0,5,0,0,0,5,0,0,0,0,0,0,0,5,0,0,5,5,0,0,10,0,0,10,10,5,0,0,0,0,0,5,0,0,10,0,0,0,0,10,0,0,5,10,10,5,0,"-",0,0]
[]
["Monday, November 3rd"]
["Crystal Palace",1,3,"Sunderland","20:00:00",null,0,0,0,0,0,0,0,0,0,0,0,0,0,0,0,0,0,0,0,0,0,0,0,0,0,0,0,0,0,0,0,0,0,0,0,5,0,0,0,0,0,0,0,0,0,0,0,5,0,0,0,5,0,0,0,0,0,0,0,0,0,0,0,5,0,0,0,0,0,0,0,"-",0,0]
[]
["Saturday, November 8th"]
["Liverpool",1,2,"Chelsea","12:45:00",null,0,0,10,10,5,0,5,10,10,5,5,10,0,10,5,0,10,5,5,0,5,0,10,5,0,10,5,10,10,5,0,10,5,10,0,10,5,5,0,0,5,5,0,10,5,5,10,5,10,5,0,10,0,5,0,0,5,0,0,5,0,0,0,0,0,0,5,10,10,5,0,5,10,5]
["Burnley",1,0,"Hull City","15:00:00",null,10,0,0,10,0,5,0,0,0,0,0,10,10,10,5,10,10,0,0,5,0,0,0,0,10,0,0,0,10,0,5,10,0,0,5,0,0,0,0,10,0,0,10,0,0,0,0,0,0,0,0,0,0,0,10,0,0,5,5,0,10,0,0,0,5,0,0,0,0,0,0,0,0,0]
["Man United",1,0,"Crystal Palace","15:00:00",null,5,5,5,5,5,5,5,5,5,5,5,5,5,5,5,5,5,5,5,5,5,5,5,5,5,5,5,5,5,5,5,5,5,0,5,5,5,5,5,5,5,5,5,5,5,5,5,0,5,5,5,5,5,5,5,5,5,5,5,5,10,5,10,5,5,5,5,5,5,5,5,5,5,5]
["Southampton",2,0,"Leicester City","15:00:00",null,5,10,10,5,5,5,5,5,10,10,5,5,5,5,0,10,10,5,5,5,5,5,10,10,5,5,10,10,10,10,10,10,10,10,10,10,10,10,10,10,5,10,5,5,10,10,10,5,5,5,5,5,10,5,5,10,5,5,5,10,5,5,0,5,10,10,5,5,10,10,5,10,10,10]
["West Ham",0,0,"Aston Villa","15:00:00",null,5,0,0,5,0,5,0,0,5,0,0,0,0,0,0,5,0,0,0,0,0,0,0,0,0,0,0,0,0,0,0,0,0,0,5,0,5,0,0,0,0,0,5,0,0,0,0,5,5,0,0,5,0,0,5,0,0,0,5,0,0,5,0,0,0,0,5,5,0,0,0,0,5,0]
["QPR",2,2,"Man City","17:30:00",null,0,0,10,0,0,5,0,0,0,0,0,0,0,0,0,0,0,0,0,0,0,0,0,0,0,0,0,0,0,0,0,0,0,5,0,0,0,0,0,0,0,10,0,0,0,5,0,0,0,0,0,0,0,0,0,0,10,0,0,0,0,0,5,0,0,0,0,0,0,0,0,0,0,0]
[]
["Sunday, November 9th"]
["Sunderland",1,1,"Everton","13:30:00",null,0,0,5,0,10,0,0,0,0,0,10,0,10,0,10,10,0,0,0,0,0,0,0,10,5,5,0,0,10,0,10,10,0,0,0,0,0,0,10,0,0,0,10,10,10,0,0,0,0,10,0,10,5,0,10,10,0,0,5,0,0,0,0,0,0,0,0,0,0,10,5,0,0,10]
["Tottenham",1,2,"Stoke City","13:30:00",null,0,0,0,0,0,0,0,0,0,0,0,0,0,0,5,0,0,0,0,0,0,0,0,0,0,0,0,0,0,0,0,0,0,0,0,0,0,0,0,0,0,5,0,0,0,0,0,0,0,0,0,0,0,0,0,0,5,0,0,0,0,0,0,0,0,0,0,0,0,0,0,0,0,0]
["West Brom",0,2,"Newcastle United","13:30:00",null,5,0,0,0,0,5,0,0,5,0,0,5,0,0,0,0,0,0,0,0,0,0,0,0,0,0,0,0,0,0,0,0,0,0,0,0,0,0,0,0,0,5,0,0,0,0,5,10,10,0,5,0,0,0,0,0,5,0,10,5,0,0,10,5,0,5,5,0,0,0,0,0,0,5]
["Swansea City",2,1,"Arsenal","16:00:00",null,0,0,10,0,10,0,0,0,0,0,10,0,0,0,0,0,0,0,0,0,0,0,0,0,0,10,0,0,0,0,5,0,0,0,0,0,0,0,0,0,0,0,0,0,0,0,0,0,0,0,0,0,0,10,0,0,5,10,0,0,5,0,0,0,"-",0,0,0,0,0,0,0,0,0]
[]
["Saturday, November 22nd"]
["Chelsea",2,0,"West Brom","15:00:00",null,10,10,5,5,5,5,10,5,10,10,5,5,5,5,5,10,5,5,10,5,10,5,10,5,5,5,10,5,5,5,10,5,10,5,10,5,5,5,5,10,10,5,5,10,10,5,5,10,5,5,5,5,10,5,5,10,10,5,5,5,5,5,5,5,"-",10,10,10,5,5,5,"-","-",5]
["Everton",2,1,"West Ham","15:00:00",null,0,5,10,5,10,5,5,5,5,10,5,5,5,10,10,0,5,10,5,0,10,0,10,5,10,10,5,10,10,5,0,10,5,0,5,10,5,10,10,5,5,0,5,10,0,0,0,0,10,5,0,10,5,0,0,5,10,10,10,0,10,10,5,10,"-",5,5,10,10,0,10,"-","-",0]
["Leicester City",0,0,"Sunderland","15:00:00",null,0,5,5,0,5,5,0,0,5,5,5,5,0,0,0,0,5,5,0,10,0,0,5,0,0,5,0,0,0,0,0,0,5,10,0,0,5,0,0,0,0,0,0,5,0,0,5,5,0,0,5,5,5,0,5,0,5,5,5,0,0,0,10,0,"-",0,5,5,5,5,5,"-","-",5]
["Man City",2,1,"Swansea City","15:00:00",null,5,5,5,5,5,5,5,5,5,10,5,10,10,10,5,5,5,10,5,5,5,5,5,10,5,5,5,10,5,5,5,5,5,0,5,0,10,5,5,5,5,10,5,5,10,0,5,10,5,5,5,5,5,0,0,5,10,5,5,0,5,5,5,5,"-",5,10,5,5,5,5,"-","-",10]
["Newcastle United",1,0,"QPR","15:00:00",null,5,10,5,10,5,5,5,5,5,5,5,5,5,5,0,5,0,5,5,5,5,0,5,5,5,5,10,5,5,10,5,5,5,0,5,5,10,5,5,5,10,10,5,5,5,10,5,5,10,10,5,5,5,0,10,5,5,10,5,5,5,10,0,5,"-",5,5,10,5,5,5,"-","-",5]
["Stoke City",1,2,"Burnley","15:00:00",null,0,0,0,0,0,0,0,0,0,0,0,0,0,0,0,0,0,0,0,0,0,0,0,0,0,0,0,0,0,0,0,0,0,0,0,0,0,0,0,0,0,0,0,0,0,0,0,0,0,0,0,0,0,0,0,0,0,0,0,0,0,0,0,0,"-",0,0,0,0,0,0,"-","-",0]
["Arsenal",1,2,"Man United","17:30:00",null,0,0,5,0,0,0,0,0,0,0,5,0,0,0,0,0,0,0,0,0,10,0,0,0,0,0,0,0,0,0,0,0,0,0,0,0,0,0,0,0,0,0,0,0,10,10,0,0,10,0,0,0,0,10,0,0,10,0,10,0,0,0,10,0,"-",0,0,0,0,0,0,"-","-",0]
[]
["Sunday, November 23rd"]
["Crystal Palace",3,1,"Liverpool","13:30:00",null,0,0,0,0,0,0,0,0,0,0,0,0,0,0,0,0,0,0,0,0,0,0,0,0,0,0,0,0,0,0,0,5,0,0,5,0,0,0,0,0,0,5,0,0,0,0,0,0,0,5,5,0,0,0,0,0,5,0,0,5,0,0,0,0,"-",0,0,0,0,5,0,"-","-",0]
["Hull City",1,2,"Tottenham","16:00:00",null,5,0,0,5,10,5,0,0,10,10,10,5,0,0,5,5,10,5,0,10,10,10,0,0,0,0,0,0,0,0,5,0,0,0,0,5,0,0,0,0,0,0,0,10,0,10,10,0,0,0,0,10,0,10,5,0,0,5,5,0,0,10,0,5,"-",0,5,0,0,10,0,"-","-",0]
[]
["Monday, November 24th"]
["Aston Villa",1,1,"Southampton","20:00:00",null,10,10,0,10,0,10,0,0,10,0,10,0,0,10,0,10,0,0,0,0,0,0,0,10,10,0,0,0,10,0,0,10,5,0,"-",0,0,0,0,0,0,0,0,10,0,0,10,0,0,0,10,0,0,0,10,0,10,10,0,0,0,10,0,0,"-",0,0,0,0,0,0,"-","-",0]
[]
["Saturday, November 29th"]
["West Brom",0,1,"Arsenal","12:45:00",null,5,5,5,5,5,5,5,5,5,5,0,5,5,5,5,0,5,5,5,5,0,5,0,5,0,5,5,0,0,5,5,5,5,5,"-",5,0,5,5,0,5,5,5,5,10,10,5,5,5,5,5,5,0,5,5,5,5,5,5,5,5,0,5,0,"-",5,5,5,5,5,5,"-",5,5]
["Burnley",1,1,"Aston Villa","15:00:00",null,10,10,0,0,10,0,0,0,10,0,0,10,5,10,0,0,10,10,10,0,0,10,0,10,0,10,0,0,0,0,0,0,5,0,"-",0,0,10,0,0,0,10,0,10,0,10,0,0,10,5,0,10,0,0,10,10,0,10,0,5,10,0,0,0,"-",0,10,10,0,0,10,"-",5,10]
["Liverpool",1,0,"Stoke City","15:00:00",null,5,10,0,5,10,5,0,10,5,0,0,5,5,5,5,0,10,0,5,10,0,10,5,5,5,5,10,5,10,5,5,5,5,0,"-",5,10,0,5,5,5,10,5,5,10,0,5,0,10,5,0,5,10,0,5,5,0,5,0,5,5,10,5,0,"-",5,5,5,0,0,5,"-",0,0]
["Man United",3,0,"Hull City","15:00:00",null,5,10,5,5,5,10,5,5,5,5,10,5,10,5,5,5,5,10,10,5,5,5,5,5,5,5,5,5,5,5,5,5,5,5,"-",10,5,5,5,5,5,5,5,5,5,10,5,5,5,5,5,5,5,5,5,5,10,10,10,10,5,5,0,5,"-",5,5,5,5,5,5,"-",5,5]
["QPR",3,2,"Leicester City","15:00:00",null,5,5,5,0,0,5,5,5,5,0,5,0,0,5,0,5,5,0,0,0,5,5,5,5,5,0,5,5,5,5,5,0,5,5,"-",0,5,5,5,5,5,5,5,5,5,5,0,0,5,5,5,0,5,5,0,5,5,5,0,5,5,5,5,0,"-",5,5,0,5,0,5,"-",0,5]
["Swansea City",1,1,"Crystal Palace","15:00:00",null,0,5,0,0,0,0,0,0,0,0,0,0,0,0,0,10,10,0,0,0,0,0,0,0,0,0,0,0,0,5,0,0,0,0,"-",0,0,0,0,0,0,0,10,0,0,0,0,0,0,0,0,0,0,0,0,0,5,0,0,0,0,0,10,0,"-",10,0,0,0,0,10,"-",0,0]
["West Ham",1,0,"Newcastle United","15:00:00",null,0,10,0,0,5,0,5,5,0,0,0,0,0,5,10,0,0,0,0,10,0,0,0,10,5,0,5,5,10,0,5,5,5,0,"-",0,10,0,5,5,10,0,0,5,0,5,5,0,0,10,0,0,5,0,0,0,0,5,0,0,0,10,0,0,"-",0,0,0,0,0,0,"-",5,0]
["Sunderland",0,0,"Chelsea","17:30:00",null,0,0,0,0,0,0,0,0,0,0,0,0,5,0,0,0,0,0,0,0,0,0,0,5,0,0,0,0,0,0,0,0,0,0,"-",0,0,0,0,0,0,0,0,0,0,0,0,0,0,0,0,0,0,0,0,0,0,0,0,0,0,0,0,0,"-",0,0,0,0,0,0,0,0,0]
[]
["Sunday, November 30th"]
["Southampton",0,3,"Man City","13:30:00",null,0,5,0,5,0,0,0,0,0,5,5,5,5,5,5,0,0,5,0,5,0,5,5,0,0,0,0,0,0,5,0,5,0,0,"-",5,0,0,0,0,5,0,5,5,5,0,0,0,5,5,5,5,5,0,0,5,0,5,5,0,5,0,0,5,"-",0,5,5,0,5,5,0,5,0]
["Tottenham",2,1,"Everton","16:00:00",null,0,0,0,0,10,10,0,0,0,0,0,0,10,10,0,10,0,0,0,0,0,0,0,0,5,0,0,0,5,0,0,0,0,0,"-",10,5,0,0,0,0,0,0,10,10,10,10,10,0,10,0,0,0,0,0,10,0,0,10,10,10,5,0,0,"-",0,5,0,0,0,0,0,5,0]
[]
[]
["Golden Boots"]
["Alexis Sanchez - Arsenal",null,null,null,{"$f":"2+1+0+0","v":3},{"$f":"COUNT(G64:CB64)","v":14},null,{"$f":"5*$E64","v":15},null,null,null,null,null,{"$f":"5*$E64","v":15},null,null,null,null,null,{"$f":"5*$E64","v":15},null,null,null,null,{"$f":"5*$E64","v":15},{"$f":"5*$E64","v":15},null,null,{"$f":"5*$E64","v":15},null,null,null,null,null,null,null,null,null,null,null,null,null,{"$f":"5*$E64","v":15},null,{"$f":"5*$E64","v":15},null,null,null,null,null,null,{"$f":"5*$E64","v":15},null,null,null,null,null,{"$f":"5*$E64","v":15},null,null,null,null,{"$f":"5*$E64","v":15},{"$f":"5*$E64","v":15},null,null,null,null,null,null,null,null,null,{"$f":"5*$E64","v":15},null,null,null,{"$f":"5*$E64","v":15}]
["Daniel Sturridge - Liverpool",null,null,null,{"$f":"0+0+0+0","v":0},52,{"$f":"5*$E65","v":0},null,{"$f":"5*$E65","v":0},{"$f":"5*$E65","v":0},{"$f":"5*$E65","v":0},null,{"$f":"5*$E65","v":0},{"$f":"5*$E65","v":0},{"$f":"5*$E65","v":0},{"$f":"5*$E65","v":0},{"$f":"5*$E65","v":0},{"$f":"5*$E65","v":0},{"$f":"5*$E65","v":0},null,null,{"$f":"5*$E65","v":0},{"$f":"5*$E65","v":0},{"$f":"5*$E65","v":0},null,{"$f":"5*$E65","v":0},{"$f":"5*$E65","v":0},{"$f":"5*$E65","v":0},null,null,{"$f":"5*$E65","v":0},{"$f":"5*$E65","v":0},{"$f":"5*$E65","v":0},null,{"$f":"5*$E65","v":0},0,0,0,0,null,0,0,null,{"$f":"5*$E65","v":0},{"$f":"5*$E65","v":0},null,{"$f":"5*$E65","v":0},{"$f":"5*$E65","v":0},null,{"$f":"5*$E65","v":0},{"$f":"5*$E65","v":0},null,{"$f":"5*$E65","v":0},{"$f":"5*$E65","v":0},{"$f":"5*$E65","v":0},{"$f":"5*$E65","v":0},{"$f":"5*$E65","v":0},{"$f":"5*$E65","v":0},null,null,{"$f":"5*$E65","v":0},{"$f":"5*$E65","v":0},{"$f":"5*$E65","v":0},0,{"$f":"5*$E65","v":0},null,null,null,{"$f":"5*$E65","v":0},null,{"$f":"5*$E65","v":0},{"$f":"5*$E65","v":0},{"$f":"5*$E65","v":0},null,{"$f":"5*$E65","v":0},{"$f":"5*$E65","v":0},null,null,{"$f":"5*$E65","v":0},{"$f":"5*$E65","v":0}]
["Diego Costa - Chelsea",null,null,null,{"$f":"0+1+1+0","v":2},39,null,{"$f":"5*$E66","v":10},null,10,null,{"$f":"5*$E66","v":10},{"$f":"5*$E66","v":10},null,10,{"$f":"5*$E66","v":10},null,null,{"$f":"5*$E66","v":10},{"$f":"5*$E66","v":10},null,null,null,null,null,{"$f":"5*$E66","v":10},null,{"$f":"5*$E66","v":10},{"$f":"5*$E66","v":10},null,10,{"$f":"5*$E66","v":10},{"$f":"5*$E66","v":10},{"$f":"5*$E66","v":10},null,{"$f":"5*$E66","v":10},{"$f":"5*$E66","v":10},null,null,null,{"$f":"5*$E66","v":10},{"$f":"5*$E66","v":10},null,{"$f":"5*$E66","v":10},null,{"$f":"5*$E66","v":10},10,{"$f":"5*$E66","v":10},{"$f":"5*$E66","v":10},null,null,{"$f":"5*$E66","v":10},{"$f":"5*$E66","v":10},{"$f":"5*$E66","v":10},null,{"$f":"5*$E66","v":10},null,{"$f":"5*$E66","v":10},{"$f":"5*$E66","v":10},{"$f":"5*$E66","v":10},{"$f":"5*$E66","v":10},null,null,null,null,{"$f":"5*$E66","v":10},{"$f":"5*$E66","v":10},{"$f":"5*$E66","v":10},null,{"$f":"5*$E66","v":10},null,null,null,null,null,null,null,{"$f":"5*$E66","v":10},{"$f":"5*$E66","v":10},10]
["Eden Hazard - Chelsea",null,null,null,{"$f":"1+0+1+0","v":2},2,null,null,null,null,{"$f":"5*$E67","v":10},null,null,null,null,null,null,null,null,null,null,null,null,null,null,null,null,null,null,null,null,null,null,null,null,null,null,null,null,null,null,null,null,null,null,null,null,null,null,null,null,null,null,null,null,null,null,null,null,null,null,null,null,null,null,null,null,null,null,null,null,null,null,null,null,{"$f":"5*$E67","v":10}]
["Edin Dzeko - Man City",null,null,null,{"$f":"0+0+0+0","v":0},6,null,null,null,null,null,{"$f":"5*$E68","v":0},null,null,null,null,null,null,null,null,null,null,null,null,null,null,null,{"$f":"5*$E68","v":0},null,null,null,null,null,null,null,null,null,null,null,null,null,null,{"$f":"5*$E68","v":0},null,null,{"$f":"5*$E68","v":0},null,null,null,null,null,null,null,null,null,null,null,null,null,null,null,null,null,null,null,null,null,{"$f":"5*$E68","v":0},null,null,null,null,null,{"$f":"5*$E68","v":0}]
["Emmanuel Adebayor - Tottenham",null,null,null,{"$f":"1+0+0+0","v":1},3,null,null,null,null,null,null,null,null,null,null,null,null,null,null,{"$f":"5*$E69","v":5},null,null,null,null,null,null,null,null,null,null,null,null,null,null,null,null,null,null,{"$f":"5*$E69","v":5},null,null,null,null,null,null,null,null,null,null,null,null,null,null,null,null,null,null,null,null,null,null,null,null,null,null,null,null,null,null,{"$f":"5*$E69","v":5}]
["Olivier Giroud - Arsenal",null,null,null,{"$f":"1+0+1+0","v":2},4,null,null,null,null,null,{"$f":"5*$E70","v":10},null,null,null,null,null,null,null,null,null,null,null,null,null,null,null,null,null,{"$f":"5*$E70","v":10},null,null,null,null,null,null,null,null,null,10,null,null,null,null,null,null,null,{"$f":"5*$E70","v":10}]
["Raheem Sterling - Liverpool",null,null,null,{"$f":"0+0+0+0","v":0},3,null,null,null,null,null,null,null,null,null,null,null,null,null,null,null,null,null,null,null,null,null,null,null,null,null,null,null,null,null,null,null,null,null,null,null,null,null,null,null,{"$f":"5*$E71","v":0},null,null,null,null,null,null,null,null,null,null,null,null,null,null,null,null,null,null,null,null,null,null,{"$f":"5*$E71","v":0},null,null,null,{"$f":"5*$E71","v":0}]
["Robin van Persie - Man United",null,null,null,{"$f":"0+0+0+1","v":1},45,{"$f":"5*$E72","v":5},{"$f":"5*$E72","v":5},null,{"$f":"5*$E72","v":5},null,null,null,null,null,{"$f":"5*$E72","v":5},{"$f":"5*$E72","v":5},{"$f":"5*$E72","v":5},{"$f":"5*$E72","v":5},null,{"$f":"5*$E72","v":5},{"$f":"5*$E72","v":5},null,{"$f":"5*$E72","v":5},{"$f":"5*$E72","v":5},null,{"$f":"5*$E72","v":5},null,null,{"$f":"5*$E72","v":5},null,{"$f":"5*$E72","v":5},{"$f":"5*$E72","v":5},{"$f":"5*$E72","v":5},{"$f":"5*$E72","v":5},{"$f":"5*$E72","v":5},null,{"$f":"5*$E72","v":5},{"$f":"5*$E72","v":5},null,null,{"$f":"5*$E72","v":5},{"$f":"5*$E72","v":5},{"$f":"5*$E72","v":5},null,null,{"$f":"5*$E72","v":5},null,{"$f":"5*$E72","v":5},{"$f":"5*$E72","v":5},{"$f":"5*$E72","v":5},null,{"$f":"5*$E72","v":5},{"$f":"5*$E72","v":5},{"$f":"5*$E72","v":5},{"$f":"5*$E72","v":5},{"$f":"5*$E72","v":5},null,{"$f":"5*$E72","v":5},{"$f":"5*$E72","v":5},{"$f":"5*$E72","v":5},{"$f":"5*$E72","v":5},null,null,{"$f":"5*$E72","v":5},{"$f":"5*$E72","v":5},{"$f":"5*$E72","v":5},{"$f":"5*$E72","v":5},null,{"$f":"5*$E72","v":5},null,{"$f":"5*$E72","v":5},null,null,null,{"$f":"5*$E72","v":5},{"$f":"5*$E72","v":5},null,{"$f":"5*$E72","v":5}]
["Romelu Lukaku - Everton",null,null,null,{"$f":"1+0+1+0","v":2},7,{"$f":"5*$E73","v":10},null,{"$f":"5*$E73","v":10},null,null,null,null,null,null,null,null,null,null,{"$f":"5*$E73","v":10},{"$f":"5*$E73","v":10},null,null,null,null,null,null,null,null,null,null,null,null,null,null,null,null,null,null,null,null,null,null,null,null,null,null,null,null,{"$f":"5*$E73","v":10},null,null,null,null,null,null,null,null,null,null,null,null,null,null,null,null,null,null,null,null,null,null,null,null,null,null,{"$f":"5*$E73","v":10},{"$f":"5*$E73","v":10}]
["Sergio Aguero - Man City",null,null,null,{"$f":"1+2+0+0","v":3},21,null,null,null,null,null,null,{"$f":"5*$E74","v":15},{"$f":"5*$E74","v":15},null,null,{"$f":"5*$E74","v":15},{"$f":"5*$E74","v":15},null,null,null,null,{"$f":"5*$E74","v":15},{"$f":"5*$E74","v":15},{"$f":"5*$E74","v":15},null,null,null,{"$f":"5*$E74","v":15},{"$f":"5*$E74","v":15},null,null,null,null,{"$f":"5*$E74","v":15},null,{"$f":"5*$E74","v":15},{"$f":"5*$E74","v":15},{"$f":"5*$E74","v":15},{"$f":"5*$E74","v":15},{"$f":"5*$E74","v":15},null,null,null,null,null,null,null,null,null,{"$f":"5*$E74","v":15},null,null,null,{"$f":"5*$E74","v":15},null,null,null,{"$f":"5*$E74","v":15},null,null,{"$f":"5*$E74","v":15},null,null,null,null,{"$f":"5*$E74","v":15},null,null,null,null,null,null,null,{"$f":"5*$E74","v":15}]
["Steven Gerrard - Liverpool",null,null,null,{"$f":"0+0+0+0","v":0},1,null,null,null,null,null,null,null,null,null,null,null,null,null,null,null,null,null,null,null,null,null,null,null,null,null,null,null,null,null,null,null,null,null,null,null,null,null,null,null,null,null,null,null,null,null,null,null,null,null,null,null,null,null,null,null,null,null,null,null,null,null,null,{"$f":"5*$E75","v":0}]
["Wayne Rooney - Man United",null,null,null,{"$f":"0+0+1+1","v":2},21,null,null,{"$f":"5*$E76","v":10},null,{"$f":"5*$E76","v":10},null,null,null,{"$f":"5*$E76","v":10},null,null,null,null,null,null,{"$f":"5*$E76","v":10},{"$f":"5*$E76","v":10},null,null,null,{"$f":"5*$E76","v":10},null,null,null,null,null,null,null,null,null,null,null,null,null,null,null,null,null,{"$f":"5*$E76","v":10},null,null,null,{"$f":"5*$E76","v":10},null,null,{"$f":"5*$E76","v":10},null,null,null,null,{"$f":"5*$E76","v":10},null,null,{"$f":"5*$E76","v":10},null,null,{"$f":"5*$E76","v":10},{"$f":"5*$E76","v":10},{"$f":"5*$E76","v":10},{"$f":"5*$E76","v":10},null,null,null,null,{"$f":"5*$E76","v":10},null,{"$f":"5*$E76","v":10},{"$f":"5*$E76","v":10},{"$f":"5*$E76","v":10},null,{"$f":"5*$E76","v":10},null,null,{"$f":"5*$E76","v":10}]
["Wilfried Bony - Swansea City",null,null,null,{"$f":"0+0+1+1","v":2},1,null,null,null,null,null,null,null,null,null,null,null,null,null,null,null,null,null,null,null,null,null,null,null,null,null,null,null,{"$f":"5*$E77","v":10}]
["Yaya Toure - Man City",null,null,null,{"$f":"0+0+1+1","v":2},3,null,null,null,null,null,null,null,null,null,null,null,null,null,null,null,null,null,null,null,null,null,null,null,null,{"$f":"5*$E78","v":10},null,null,null,null,null,null,null,null,null,null,null,null,null,null,null,null,null,null,null,null,null,null,null,null,null,null,null,null,null,null,null,null,null,null,null,null,null,null,{"$f":"5*$E78","v":10},null,{"$f":"5*$E78","v":10}]
[]
[]
["Sack Race"]
["Alan Irvine - West Brom",null,null,null,null,{"$f":"COUNT(G82:CB82)","v":5},null,null,null,null,null,null,{"$f":"25*$E82","v":0},null,null,null,null,null,{"$f":"25*$E82","v":0},null,null,null,null,null,null,null,null,null,null,null,null,null,{"$f":"25*$E82","v":0},null,null,null,null,null,null,null,null,null,null,null,null,null,null,null,null,null,null,null,null,null,null,null,null,null,null,null,null,null,{"$f":"25*$E82","v":0},null,null,null,null,null,null,null,null,null,{"$f":"25*$E82","v":0}]
["Alan Pardew - Newcastle",null,null,null,null,8,{"$f":"25*$E83","v":0},null,null,null,{"$f":"25*$E83","v":0},null,null,null,null,null,null,null,null,null,{"$f":"25*$E83","v":0},{"$f":"25*$E83","v":0},null,null,null,null,null,null,null,null,null,null,null,null,null,null,{"$f":"25*$E83","v":0},null,null,null,null,null,null,null,null,null,null,null,null,null,{"$f":"25*$E83","v":0},null,null,null,null,null,null,null,null,null,null,null,null,null,null,null,{"$f":"25*$E83","v":0},null,null,null,null,null,null,null,null,null,null,null,null,{"$f":"25*$E83","v":0}]
["Arsene Wenger - Arsenal",null,null,null,null,0]
["Brendan Rodgers - Liverpool",null,null,null,null,0]
["Garry Monk - Swansea City",null,null,null,null,6,null,null,null,null,null,null,null,null,null,null,null,null,null,null,null,null,null,null,null,null,{"$f":"25*$E86","v":0},{"$f":"25*$E86","v":0},null,null,null,null,null,null,null,null,null,null,null,null,null,null,null,null,null,null,null,null,{"$f":"25*$E86","v":0},null,null,null,{"$f":"25*$E86","v":0},null,{"$f":"25*$E86","v":0},null,null,null,null,null,null,null,null,{"$f":"25*$E86","v":0}]
["Gus Poyet - Sunderland",null,null,null,null,0]
["Harry Redknapp - QPR",null,null,null,null,2,null,null,null,null,null,null,null,null,null,null,null,null,null,null,null,null,null,null,null,null,null,null,null,null,null,null,null,null,null,null,null,null,null,{"$f":"25*$E88","v":0},null,null,null,null,null,null,null,null,null,null,null,null,null,null,null,null,null,null,null,null,null,null,null,null,null,null,null,null,null,{"$f":"25*$E88","v":0}]
["Jose Mourinho - Chelsea",null,null,null,null,0]
["Louis van Gaal - Man United",null,null,null,null,1,null,null,null,null,null,null,null,null,null,null,null,null,null,null,null,null,null,null,null,null,null,null,null,null,null,null,null,null,null,null,null,null,null,null,null,null,null,null,null,null,null,null,null,null,null,null,null,null,null,null,null,null,null,null,null,null,null,null,null,null,null,null,{"$f":"25*$E90","v":0}]
["Manuel Pellegrini - Man City",null,null,null,null,0]
["Mark Hughes - Stoke City",null,null,null,null,0]
["Mauricio Pochettino - Tottenham",null,null,null,null,0]
["Nigel Pearson - Leicester City",null,null,null,null,3,null,null,null,null,null,{"$f":"25*$E94","v":0},null,null,null,null,null,null,null,null,null,null,null,null,null,null,null,null,null,null,null,{"$f":"25*$E94","v":0},null,null,null,{"$f":"25*$E94","v":0}]
["Paul Lambert - Aston Villa",null,null,null,null,13,null,null,null,null,null,null,null,null,null,null,null,null,null,{"$f":"25*$E95","v":0},null,null,null,null,{"$f":"25*$E95","v":0},{"$f":"25*$E95","v":0},null,null,null,{"$f":"25*$E95","v":0},{"$f":"25*$E95","v":0},null,null,null,null,null,null,{"$f":"25*$E95","v":0},{"$f":"25*$E95","v":0},null,null,null,null,null,{"$f":"25*$E95","v":0},{"$f":"25*$E95","v":0},null,{"$f":"25*$E95","v":0},null,{"$f":"25*$E95","v":0},null,null,null,{"$f":"25*$E95","v":0},null,null,null,null,null,null,null,null,null,null,{"$f":"25*$E95","v":0}]
["Roberto Martinez - Everton",null,null,null,null,0]
["Ronald Koeman - Southampton",null,null,null,null,4,null,null,null,null,null,null,null,null,null,null,null,{"$f":"25*$E97","v":0},null,null,null,null,null,null,null,null,null,null,null,null,null,null,null,null,null,null,null,null,null,null,null,{"$f":"25*$E97","v":0},null,null,null,null,null,null,null,null,null,null,null,null,null,null,null,null,null,null,null,null,null,null,null,null,null,{"$f":"25*$E97","v":0},null,null,null,null,null,{"$f":"25*$E97","v":0}]
["Sam Allardyce - West Ham",null,null,null,null,27,null,null,{"$f":"25*$E98","v":0},{"$f":"25*$E98","v":0},null,null,null,{"$f":"25*$E98","v":0},{"$f":"25*$E98","v":0},{"$f":"25*$E98","v":0},{"$f":"25*$E98","v":0},null,null,null,null,null,{"$f":"25*$E98","v":0},{"$f":"25*$E98","v":0},null,null,null,null,{"$f":"25*$E98","v":0},null,null,null,null,{"$f":"25*$E98","v":0},{"$f":"25*$E98","v":0},null,null,null,null,null,{"$f":"25*$E98","v":0},null,{"$f":"25*$E98","v":0},{"$f":"25*$E98","v":0},null,null,{"$f":"25*$E98","v":0},null,null,null,null,{"$f":"25*$E98","v":0},null,null,null,{"$f":"25*$E98","v":0},{"$f":"25*$E98","v":0},null,null,{"$f":"25*$E98","v":0},{"$f":"25*$E98","v":0},null,null,null,null,{"$f":"25*$E98","v":0},null,null,null,null,{"$f":"25*$E98","v":0},{"$f":"25*$E98","v":0},null,null,{"$f":"25*$E98","v":0},{"$f":"25*$E98","v":0},{"$f":"25*$E98","v":0},null,{"$f":"25*$E98","v":0}]
["Sean Dyche - Burnley",null,null,null,null,4,null,{"$f":"25*$E99","v":0},null,null,null,null,null,null,null,null,null,null,null,null,null,null,null,null,null,null,null,null,null,null,null,null,null,null,null,null,null,null,null,null,null,null,null,null,null,null,null,null,null,null,null,null,null,null,null,null,null,{"$f":"25*$E99","v":0},{"$f":"25*$E99","v":0},null,null,{"$f":"25*$E99","v":0}]
["Steve Bruce - Hull City",null,null,null,null,1,null,null,null,null,null,null,null,null,null,null,null,null,null,null,null,null,null,null,null,null,null,null,null,null,null,null,null,null,null,null,null,null,null,null,null,null,null,null,null,null,null,null,null,null,null,null,null,null,null,null,null,null,null,null,null,null,null,null,null,null,null,null,null,null,null,null,null,null,null,null,null,{"$f":"25*$E100","v":0}]
[]
["Total Points - November",null,null,null,null,null,{"$f":"SUM(G2:G101)","v":145},185,150,145,165,155,105,125,175,135,145,155,135,195,120,155,145,145,125,145,115,120,140,175,125,130,120,115,155,120,135,160,{"$f":"SUM(AM2:AM101)","v":135},110,100,130,135,120,115,95,130,150,135,185,185,160,145,125,160,155,100,150,135,110,140,160,175,165,180,120,155,130,115,125,{"$f":"SUM(BS2:BS101)","v":55},105,145,155,125,135,140,55,100,135]
[]
[null,null,null,null,null,null,{"$f":"IF(COUNT(G63:G101)=4,\"a\",\"g\")","v":"a"},"a","a","a","a","a","a","a","a","a","a","a","a","a","a","a","a","a","a","a","a","a","a","a","a","a","a","a","a","a","a","a","a","a","a","a","a","a","a","a","a","a","a","a","a","a","a","a","a","a","a","a","a","a","a","a","a","a","a","a","a","a","a","a",{"$f":"IF(COUNT(BS63:BS101)=4,\"a\",\"g\")","v":"a"},"a","a","a","a","a","a","a","a","a"]

{"sheet":"December","index":5,"n_rows":131,"n_cols":80,"rows_kept":131,"cut":false,"hidden":false,"merged":[[75,0,75,4],[86,0,86,4],[31,0,31,4],[40,0,40,4],[47,0,47,4],[56,0,56,4],[63,0,63,4],[44,0,44,4],[60,0,60,4],[1,0,1,4],[9,0,9,4],[15,0,15,4],[24,0,24,4],[28,0,28,4]]}
[null,null,null,null,null,null,"Aaron Byrne","Aidan Knight","Aidan Scanlon","Aidan White","Aiden Desch","Alan Boyle","Anastas Popov","Andy Dunne","Anthony Hughes","Barry Healy","Brendan Maguire","Brian Mullen","Brian Prendergast","Brian Sotolongo","Chris Hall","Ciaran O'Hart","Cillian Conway","Colin McAnaspie","Con McSweeney","Conor Horan","Craig Calvert","Dave Green","Dave McGinley","David Bone","David Byrne","David Cooney","David Keavney","Eamon Fox","Fiachra Moynihan","Gareth Pierpoint","Gary McGurk","Gavin Morgan","Gerry Draper","Gerry Moore","Ian Healy","Javier Suarez Barreiro","Jenny Ellis","Joe Behan","Joe O'Hehir","Joe Turner","Jonathan Fox","Keith Horan","Kevin Donohoe","Kevin Philpott","Konstantin Kulev","Kris Stainton","Liam Butler","Liam Geraghty","Maria Jordan","Mike Hall","Niall Carroll","Oisin O'Reilly","Padraic Carney","Pat Jordan","Paul Moore","Paul Prendergast","Paul Stainton","Peter Behan","Phil Doyle","Philip Jordan","Ralph Goodwin","Ray Ellis","Rhona Devlin","Richard Johnston","Sean Moloney","Sean O'Mairtin","Shane Horan","Sharon Behan","Simon Purdue","Siobhan Murphy","Terry Behan","Tiago Moreira","Tom McHugh","Wayne Donovan"]
["Tuesday, December 2nd"]
["Burnley",1,1,"Newcastle United","19:45:00",null,0,0,0,10,0,0,0,0,10,10,0,0,5,0,0,10,10,0,0,0,0,10,0,0,"-",10,0,10,10,0,0,0,0,0,"-",0,0,10,10,5,0,0,0,0,0,0,0,0,0,0,10,0,10,0,0,0,0,0,10,0,0,0,0,0,"-",0,0,10,10,0,0,0,0,0]
["Leicester City",1,3,"Liverpool","19:45:00",null,5,0,0,0,0,0,5,5,0,5,0,0,5,0,5,0,5,5,5,0,5,5,5,0,"-",5,0,5,5,10,10,5,5,0,"-",5,0,0,5,5,5,10,5,5,0,0,5,5,5,5,0,5,0,5,5,5,0,5,5,5,5,0,5,10,"-",5,5,5,5,0,0,0,5,0]
["Man United",2,1,"Stoke City","19:45:00",null,5,5,5,5,0,5,5,10,5,5,5,5,5,10,5,5,5,10,5,5,5,5,5,5,"-",5,5,5,5,5,5,5,5,10,"-",5,5,5,5,5,5,0,10,10,5,5,5,0,5,10,5,10,5,10,5,5,5,5,5,5,5,5,0,5,"-",5,5,10,5,5,5,5,5,10]
["Swansea City",2,0,"QPR","19:45:00",null,5,5,10,0,0,5,10,5,5,10,10,5,10,5,0,0,0,5,5,5,5,0,5,10,"-",10,5,10,10,5,10,5,5,5,"-",0,5,5,5,10,5,0,5,5,5,0,5,0,0,5,0,10,5,5,5,5,5,5,0,5,5,5,0,5,"-",5,5,5,5,5,10,0,5,5]
["Crystal Palace",0,1,"Aston Villa","20:00:00",null,0,0,0,0,0,0,0,0,0,0,0,0,0,0,0,0,0,0,0,0,0,0,0,0,"-",0,0,0,0,0,0,0,0,0,"-",5,0,0,5,0,0,0,0,0,0,0,5,5,10,0,0,0,0,0,0,0,0,0,5,0,0,0,0,0,"-",0,0,0,0,0,0,0,0,0]
["West Brom",1,2,"West Ham United","20:00:00",null,0,0,0,0,0,0,10,0,5,0,0,0,0,0,0,10,0,5,0,0,5,0,0,0,"-",10,5,0,0,10,0,0,0,0,"-",5,0,5,10,0,5,5,0,0,0,5,0,0,0,0,10,0,0,10,0,0,0,5,0,10,10,0,0,5,"-",0,0,0,10,5,0,0,0,10]
[]
["Wednesday, December 3rd"]
["Arsenal",1,0,"Southampton","19:45:00",null,5,5,5,5,10,5,10,0,0,5,5,5,5,5,10,5,5,0,5,10,5,0,5,0,"-",0,5,5,5,5,0,5,5,5,"-",0,10,0,5,5,10,5,5,5,5,0,5,0,5,5,5,0,5,0,5,5,0,5,5,0,5,10,0,10,"-",5,5,10,5,5,5,5,0,5]
["Chelsea",3,0,"Tottenham","19:45:00",null,5,10,5,0,0,5,5,5,5,5,10,5,5,5,5,5,5,5,5,5,5,5,5,5,"-",10,10,5,10,5,5,5,5,5,"-",5,5,10,10,5,5,5,5,5,5,0,5,5,5,5,0,5,5,5,5,5,5,5,5,10,10,5,5,5,"-",5,5,5,5,5,5,5,5,5]
["Everton",1,1,"Hull City","19:45:00",null,0,0,0,0,0,0,0,0,0,0,0,0,0,0,10,0,0,0,0,0,0,0,0,0,"-",0,0,0,0,0,0,0,0,0,"-",0,0,0,0,0,0,10,0,0,0,0,0,0,0,0,0,10,0,0,10,0,0,0,0,0,0,0,10,0,"-",0,0,0,0,0,0,0,10,0]
["Sunderland",1,4,"Man City","19:45:00",null,5,0,0,5,5,5,5,5,0,5,5,5,5,5,0,5,5,5,5,5,5,5,5,5,"-",5,5,5,5,5,0,5,5,0,"-",5,"-",5,5,5,5,0,5,5,5,5,5,5,5,5,5,5,5,5,5,5,0,5,5,5,5,0,5,5,"-",5,5,5,5,5,0,0,0,0]
[]
["Saturday, December 6th"]
["Newcastle United",2,1,"Chelsea","12:45:00",null,10,0,0,0,0,0,0,0,0,0,0,5,0,0,0,0,0,0,0,0,0,0,0,0,0,0,5,0,0,0,0,0,0,0,"-",0,"-",0,0,0,0,0,0,0,0,0,0,0,0,0,0,0,0,0,0,0,"-",10,0,0,0,5,0,0,"-",0,0,0,0,0,0,"-",0,0]
["Hull City",0,0,"West Brom","15:00:00",null,0,0,0,5,5,0,0,0,5,5,0,0,0,0,0,0,0,5,0,5,0,5,0,5,0,0,0,0,0,0,0,0,5,10,"-",10,"-",0,5,0,0,0,0,0,0,0,0,0,0,5,0,5,0,0,0,0,"-",0,0,5,5,0,0,5,"-",5,5,5,5,5,5,"-",10,0]
["Liverpool",0,0,"Sunderland","15:00:00",null,0,0,0,0,0,0,0,0,0,0,5,0,0,0,0,0,0,0,0,0,0,0,0,0,0,0,0,0,0,0,0,0,0,0,"-",0,"-",0,0,0,0,0,0,0,0,0,0,0,0,0,5,0,0,0,0,0,"-",0,5,0,0,0,0,0,"-",0,0,0,0,0,0,"-",0,5]
["QPR",2,0,"Burnley","15:00:00",null,5,5,5,0,5,5,5,5,5,5,10,10,10,5,5,5,5,0,5,5,5,0,0,5,5,0,5,5,5,5,5,0,10,5,"-",0,"-",0,5,10,5,0,5,5,5,5,5,0,0,5,10,10,5,5,0,5,"-",5,5,5,5,5,0,5,"-",0,5,5,5,5,5,"-",5,5]
["Stoke City",3,2,"Arsenal","15:00:00",null,5,0,0,0,0,0,0,0,0,0,0,5,0,0,0,0,0,0,0,0,0,0,0,0,0,0,5,0,0,0,0,0,0,0,"-",0,"-",0,0,0,0,0,0,0,0,0,0,0,0,0,0,0,0,0,0,0,"-",5,0,5,0,"-",5,0,"-",0,0,0,0,0,0,"-",0,0]
["Tottenham",0,0,"Crystal Palace","15:00:00",null,0,0,0,0,0,0,0,0,0,0,0,0,0,0,0,0,0,0,0,0,0,0,0,0,0,0,0,0,0,0,0,0,0,5,"-",0,"-",0,0,0,0,0,0,0,0,0,0,5,0,0,0,0,0,0,0,0,"-",0,0,0,0,"-",0,0,"-",0,0,0,0,0,0,"-",0,0]
["Man City",1,0,"Everton","17:30:00",null,5,5,5,5,5,5,5,5,5,5,5,5,5,5,5,5,5,5,5,5,5,5,5,5,5,5,10,5,5,5,5,5,5,5,"-",0,"-",5,5,5,5,5,5,5,5,5,5,5,5,5,5,5,5,5,5,5,"-",5,5,5,5,"-",5,5,"-",5,5,5,5,5,10,"-",5,5]
[]
["Sunday, December 7th"]
["West Ham United",3,1,"Swansea City","13:30:00",null,5,5,0,0,5,10,5,5,0,0,0,5,0,5,5,0,5,5,5,0,0,0,5,0,0,5,5,5,5,5,5,5,5,0,"-",5,"-",0,5,0,5,5,5,0,5,5,5,0,0,5,5,0,5,0,0,5,"-",5,0,5,0,"-",5,5,"-",5,0,0,0,5,5,"-",0,0]
["Aston Villa",2,1,"Leicester City","16:00:00",null,10,10,10,5,0,0,5,10,10,10,5,5,5,10,5,5,5,5,10,0,10,10,0,10,5,0,5,10,10,10,10,10,5,5,"-",5,"-",5,5,0,10,10,5,10,5,0,0,0,0,10,5,10,5,10,5,5,"-",10,5,5,5,"-",0,0,"-",5,10,5,5,5,5,"-",5,5]
[]
["Monday, December 8th"]
["Southampton",1,2,"Man United","20:00:00",null,0,10,5,5,0,0,5,0,10,10,10,0,0,0,10,0,10,0,0,10,10,10,10,0,0,0,0,0,10,0,0,0,0,0,"-",0,"-",0,5,5,5,5,10,10,0,5,5,0,5,0,0,10,0,5,5,0,"-",0,10,5,0,"-",5,5,"-",10,0,10,10,5,0,"-",0,0]
[]
["Saturday, December 13th"]
["Burnley",1,0,"Southampton","15:00:00",null,0,0,0,10,0,0,0,0,0,0,0,0,0,0,0,0,0,0,0,0,0,0,0,0,0,0,0,0,0,0,0,0,0,0,"-",0,"-",0,0,10,0,0,0,5,0,0,0,0,0,0,0,0,5,0,0,0,"-",0,0,0,0,0,0,0,"-",0,0,0,0,0,0,0,0,0]
["Chelsea",2,0,"Hull City","15:00:00",null,5,5,5,5,10,5,10,5,10,5,5,5,10,10,5,10,5,10,10,5,5,5,5,5,5,5,10,5,5,5,5,5,10,10,"-",5,"-",10,5,5,10,5,10,5,5,5,5,10,5,10,5,10,5,5,5,5,"-",5,10,5,5,5,5,5,"-",5,10,10,5,10,5,10,5,10]
["Crystal Palace",1,1,"Stoke City","15:00:00",null,0,10,10,0,10,0,10,5,10,0,0,0,0,0,0,0,10,10,10,10,10,10,0,0,0,5,0,10,0,5,10,0,0,0,"-",5,"-",10,0,0,0,5,0,0,0,0,10,0,0,10,0,0,10,0,0,10,"-",5,10,0,0,0,0,10,"-",0,0,0,10,0,0,0,10,10]
["Leicester City",0,1,"Man City","15:00:00",null,5,5,5,0,5,5,5,5,5,5,5,5,5,5,5,0,5,5,5,5,5,5,5,5,5,5,5,5,5,5,5,5,5,5,"-",5,"-",10,5,5,5,5,5,0,5,5,5,0,5,5,5,5,5,5,5,5,"-",5,5,5,5,5,5,5,"-",5,5,5,5,5,5,5,5,5]
["Sunderland",1,1,"West Ham United","15:00:00",null,10,0,0,0,10,0,10,0,10,10,0,10,0,0,0,0,0,10,10,0,0,0,10,0,0,10,0,10,10,0,0,0,10,5,"-",0,"-",0,10,5,0,0,10,0,0,0,10,0,0,0,10,0,10,0,10,10,"-",10,0,5,10,10,10,10,"-",0,0,10,0,10,0,0,0,10]
["West Brom",1,0,"Aston Villa","15:00:00",null,0,10,0,10,0,5,0,0,0,0,0,0,10,0,0,0,0,5,0,0,0,5,0,0,5,0,0,0,0,5,0,0,0,0,"-",0,"-",0,0,0,0,0,10,5,0,0,10,0,0,0,0,0,0,5,0,5,"-",0,0,0,0,5,0,0,"-",0,0,0,10,10,0,0,0,0]
["Arsenal",4,1,"Newcastle United","17:30:00",null,5,5,0,5,0,5,5,5,5,5,5,5,5,5,5,0,5,5,5,5,5,0,5,5,5,5,5,5,5,5,5,5,5,5,"-",5,"-",0,5,5,5,5,5,5,0,0,5,0,5,0,5,0,5,5,0,5,"-",5,5,0,5,5,5,5,"-",5,5,5,5,5,5,5,5,5]
[]
["Sunday, December 14th"]
["Man United",3,0,"Liverpool","13:30:00",null,0,5,5,5,0,5,5,0,5,5,5,0,10,5,5,5,5,5,5,5,5,5,5,5,5,5,5,5,5,5,5,5,5,0,"-",0,"-",5,5,5,5,5,5,5,5,5,0,0,5,5,10,0,5,5,0,0,"-",5,5,5,5,5,0,0,"-",5,5,5,5,10,5,5,5,5]
["Swansea City",1,2,"Tottenham","16:00:00",null,5,0,0,0,10,0,0,0,0,0,0,0,0,0,5,0,0,5,0,0,0,10,0,0,0,0,0,0,0,0,0,0,0,0,"-",0,"-",0,0,0,0,0,0,0,0,0,0,0,0,0,0,0,0,0,0,0,"-",0,0,0,0,10,0,10,"-",0,5,5,0,0,0,0,0,0]
[]
["Monday, December 15th"]
["Everton",3,1,"QPR","20:00:00",null,5,5,5,5,10,5,5,5,5,5,5,5,5,5,0,5,5,5,5,5,5,5,5,5,5,5,5,5,5,5,5,5,5,5,"-",5,"-",5,5,5,5,5,5,5,0,0,5,5,5,5,5,5,5,5,5,5,"-",5,5,5,5,10,0,5,"-",5,5,5,5,5,5,5,10,5]
[]
["Saturday, December 20th"]
["Man City",3,0,"Crystal Palace","12:45:00",null,5,5,5,10,5,5,5,10,5,5,10,5,5,10,5,5,10,10,5,5,5,10,5,10,"-",10,10,5,5,10,5,10,5,5,"-",10,"-",5,10,5,5,5,0,5,5,5,10,5,5,5,5,10,5,10,5,10,"-",5,10,10,10,"-",5,5,"-",5,5,10,5,5,10,"-",10,5]
["Aston Villa",1,1,"Man United","15:00:00",null,0,0,0,0,5,0,0,0,0,0,0,0,0,0,0,10,0,0,0,0,0,0,0,0,"-",0,0,0,0,0,0,0,10,0,"-",10,"-",0,0,0,0,0,10,0,0,0,0,10,0,0,0,0,0,0,0,0,0,0,0,0,0,"-",10,0,"-",0,0,0,0,0,0,"-",0,0]
["Hull City",0,1,"Swansea City","15:00:00",null,0,0,0,0,0,0,0,0,5,10,0,10,0,0,0,0,0,0,0,10,5,5,0,0,"-",0,0,0,0,0,0,0,0,0,"-",0,"-",0,0,0,0,5,0,0,10,0,0,0,0,0,0,5,0,5,0,0,0,0,0,0,0,"-",0,5,"-",0,5,0,5,0,0,"-",10,0]
["QPR",3,2,"West Brom","15:00:00",null,0,5,5,0,0,0,5,0,5,5,0,0,5,0,5,0,5,0,5,5,5,0,5,0,"-",5,5,5,0,5,0,5,5,0,"-",0,"-",0,5,5,5,0,0,5,5,5,5,0,5,5,5,0,5,5,5,5,5,5,0,5,5,"-",5,0,"-",5,5,0,5,5,5,"-",0,5]
["Southampton",3,0,"Everton","15:00:00",null,0,0,0,0,5,0,5,5,0,0,0,0,0,5,5,5,0,0,5,0,0,0,0,5,"-",0,0,0,0,0,5,0,0,0,"-",0,"-",0,0,0,5,0,0,0,0,0,0,0,0,5,0,0,0,0,5,0,0,5,5,0,5,"-",0,0,"-",0,0,0,0,5,0,"-",0,0]
["Tottenham",2,1,"Burnley","15:00:00",null,5,5,5,5,5,10,5,5,5,10,5,5,5,5,5,5,5,5,5,10,5,10,5,5,"-",5,5,5,5,10,5,5,5,5,"-",5,"-",5,10,5,5,5,0,5,5,5,5,5,10,5,5,5,5,10,0,5,5,10,5,10,5,"-",0,10,"-",5,10,5,5,5,5,"-",5,5]
["West Ham United",2,0,"Leicester City","15:00:00",null,5,5,10,5,5,5,10,10,5,10,10,5,10,5,5,5,5,10,10,5,10,10,10,10,"-",10,10,5,5,10,10,10,10,5,"-",10,"-",5,5,10,5,5,0,5,10,5,10,5,0,5,5,5,5,5,10,10,5,5,5,5,5,"-",0,10,"-",10,5,5,10,5,0,"-",5,10]
[]
["Sunday, December 21st"]
["Newcastle United",0,1,"Sunderland","13:30:00",null,0,0,0,0,0,0,0,0,0,0,0,0,0,0,0,0,0,0,0,0,0,0,0,0,"-",0,5,0,0,0,5,0,0,0,"-",0,"-",0,5,0,0,0,0,0,0,0,0,10,0,0,0,0,0,0,0,0,0,0,0,0,0,"-",0,0,"-",0,0,0,0,0,0,"-",0,0]
["Liverpool",2,2,"Arsenal","16:00:00",null,5,0,0,0,0,0,0,0,5,0,0,0,10,0,0,10,5,5,0,0,10,5,5,0,"-",0,0,5,5,0,0,0,0,0,"-",5,"-",0,0,10,0,10,5,0,0,0,0,5,5,5,5,10,10,0,10,0,0,0,10,10,0,"-",0,0,"-",10,0,0,0,0,0,"-",0,5]
[]
["Monday, December 22nd"]
["Stoke City",0,2,"Chelsea","20:00:00",null,5,5,5,10,5,0,10,5,0,5,10,5,5,5,5,10,5,10,10,5,10,5,5,5,"-",5,5,10,10,10,0,10,10,0,"-",5,"-",10,5,0,5,5,0,10,10,10,5,5,10,5,5,5,0,5,10,10,0,0,5,5,10,"-",0,0,"-",5,5,5,5,10,0,"-",5,5]
[]
["Friday, December 26th"]
["Chelsea",2,0,"West Ham United","12:45:00",null,5,10,5,5,0,0,10,5,5,5,5,10,10,5,5,5,10,5,10,5,10,5,10,10,5,10,10,10,5,5,10,10,10,5,"-",10,"-",5,5,10,5,10,5,5,5,5,10,5,5,5,10,10,10,5,10,10,10,"-",5,5,10,"-",0,5,"-",10,5,5,5,5,0,"-",5,5]
["Burnley",0,1,"Liverpool","15:00:00",null,5,5,5,5,5,0,5,5,0,5,0,10,5,5,5,0,5,5,5,10,5,5,5,5,5,0,5,5,5,10,10,5,5,0,"-",5,"-",0,5,5,10,0,5,10,5,10,5,5,5,5,0,5,0,5,5,5,0,"-",5,5,10,"-",5,5,"-",5,5,5,5,0,5,"-",5,5]
["Crystal Palace",1,3,"Southampton","15:00:00",null,5,0,5,5,0,0,5,5,0,5,0,5,0,0,5,0,0,5,0,5,5,5,0,10,0,5,0,5,0,0,0,0,5,5,"-",5,"-",0,0,0,5,0,0,5,5,5,5,5,0,0,0,5,0,10,0,0,0,"-",0,0,5,"-",0,0,"-",0,5,5,5,5,0,"-",5,0]
["Everton",0,1,"Stoke City","15:00:00",null,0,0,0,0,0,0,0,0,0,0,0,0,0,0,0,0,0,0,0,0,0,0,0,0,0,0,0,0,0,0,0,0,0,0,"-",0,"-",0,0,0,0,0,0,0,0,0,0,0,0,0,0,0,0,0,0,0,0,"-",0,0,0,"-",0,0,"-",0,0,0,0,5,0,"-",0,0]
["Leicester City",1,2,"Tottenham","15:00:00",null,5,10,5,5,5,10,5,10,0,5,0,5,5,10,0,5,5,5,0,10,5,5,10,0,5,10,0,10,5,0,5,5,10,10,"-",10,"-",5,5,5,5,0,10,5,5,10,5,10,0,10,0,5,10,10,0,5,0,"-",5,10,0,"-",0,10,"-",0,5,5,5,5,0,"-",5,5]
["Man United",3,1,"Newcastle United","15:00:00",null,10,5,10,5,5,10,5,5,5,5,5,5,5,10,10,5,5,5,5,5,10,5,5,5,5,5,5,5,10,5,5,5,5,5,"-",5,"-",5,5,5,5,5,5,5,5,10,0,0,5,5,5,5,5,10,0,5,5,"-",10,5,5,"-",5,5,"-",0,5,5,5,5,10,"-",10,5]
["Sunderland",1,3,"Hull City","15:00:00",null,0,0,0,0,0,0,0,0,0,0,0,0,0,0,0,0,0,0,0,0,0,0,0,0,0,0,0,0,0,0,0,0,0,0,"-",0,"-",0,0,0,0,0,0,0,0,0,0,0,0,0,0,0,0,0,0,0,0,"-",0,0,0,"-",0,0,"-",0,0,0,0,0,0,"-",5,0]
["Swansea City",1,0,"Aston Villa","15:00:00",null,0,5,0,0,10,0,10,5,5,5,5,5,5,10,0,0,0,0,5,5,5,5,5,10,5,5,5,10,5,5,5,5,0,5,"-",0,"-",5,5,5,10,5,0,5,10,0,0,0,0,5,5,0,5,5,10,10,5,"-",0,5,5,"-",0,0,"-",5,5,0,5,10,5,"-",5,5]
["West Brom",1,3,"Man City","15:00:00",null,5,5,5,5,10,5,5,5,0,5,5,5,5,5,5,10,5,5,5,5,5,10,5,5,5,10,5,5,5,5,5,5,5,10,"-",5,"-",5,5,10,5,0,10,5,5,5,10,5,5,5,0,5,5,5,5,5,0,"-",5,5,5,"-",0,10,"-",10,10,10,5,5,5,"-",10,5]
["Arsenal",2,1,"QPR","17:30:00",null,10,5,5,5,5,5,5,10,10,5,5,5,10,5,5,5,5,5,5,5,5,5,5,5,10,5,5,5,5,5,5,5,5,5,"-",5,"-",5,5,5,5,5,5,5,5,10,5,5,10,10,5,10,5,5,5,10,5,"-",5,10,5,"-",0,5,"-",5,5,5,5,5,5,"-",5,10]
[]
["Sunday, December 28th"]
["Tottenham",0,0,"Man United","12:00:00",null,0,0,0,0,0,0,5,5,0,5,0,5,0,0,0,0,0,0,0,0,0,5,0,5,5,5,0,5,5,0,5,5,5,5,"-",0,"-",0,0,0,0,0,5,0,0,0,0,0,0,0,0,0,0,0,0,5,0,5,0,0,0,"-",0,0,"-",0,0,0,0,5,5,"-",5,5]
["Southampton",1,1,"Chelsea","14:05:00",null,0,0,0,0,0,0,0,0,0,0,0,0,0,0,0,0,0,0,10,0,0,0,0,0,0,0,0,0,0,0,10,0,0,10,"-",0,"-",0,0,0,0,0,0,0,0,5,0,0,0,0,0,0,10,0,0,0,0,0,10,0,0,"-",0,0,"-",5,0,0,0,0,0,"-",0,0]
["Aston Villa",0,0,"Sunderland","15:00:00",null,0,5,5,0,0,0,5,5,0,5,0,0,0,0,0,0,5,0,5,5,0,5,0,5,0,5,5,0,0,5,0,5,0,10,"-",0,"-",0,5,0,0,0,5,0,0,0,0,5,5,0,0,5,0,0,0,0,0,0,5,0,0,"-",0,5,"-",0,0,5,5,5,0,"-",10,5]
["Hull City",0,1,"Leicester City","15:00:00",null,0,0,0,0,0,0,0,0,0,0,0,0,0,0,0,0,0,0,0,0,0,0,0,0,0,0,0,0,0,0,0,0,0,0,"-",0,"-",0,0,0,0,0,0,0,0,0,0,0,0,0,0,0,0,0,0,0,0,0,0,0,0,"-",0,0,"-",0,0,0,0,0,0,"-",5,0]
["Man City",2,2,"Burnley","15:00:00",null,0,0,0,0,0,0,0,0,0,0,0,0,0,0,0,0,0,0,0,0,0,0,0,0,0,0,0,0,0,0,0,0,0,0,"-",0,"-",0,0,0,0,0,0,0,0,0,0,0,0,0,0,0,0,0,0,0,0,0,0,0,0,"-",5,0,"-",0,0,0,0,0,0,"-",0,0]
["QPR",0,0,"Crystal Palace","15:00:00",null,0,0,0,0,0,5,5,5,0,5,0,0,10,0,5,5,0,0,0,5,0,0,0,5,0,0,0,0,5,5,0,5,0,0,"-",10,"-",0,0,0,0,0,0,0,0,0,10,0,5,0,0,0,0,0,5,0,0,0,0,0,0,"-",0,5,"-",0,0,5,0,0,10,"-",0,0]
["Stoke City",2,0,"West Brom","15:00:00",null,5,0,5,5,10,5,5,0,10,5,5,0,10,5,5,5,5,0,0,0,10,5,5,0,10,5,5,5,5,5,10,5,10,10,"-",5,"-",5,10,5,5,10,5,5,10,0,5,0,0,5,10,0,5,5,5,0,5,5,0,5,5,"-",0,5,"-",0,0,5,5,5,0,"-",0,5]
["West Ham United",1,2,"Arsenal","15:00:00",null,0,5,0,0,0,10,0,0,0,10,0,5,0,0,5,0,0,10,10,0,0,5,0,5,0,0,0,10,10,0,5,10,10,10,"-",10,"-",0,0,0,5,0,5,10,0,10,0,5,10,0,0,10,5,5,0,0,0,10,10,0,5,"-",5,0,"-",0,5,10,0,0,10,"-",0,0]
["Newcastle United",3,2,"Everton","16:15:00",null,5,0,5,0,5,0,5,0,5,0,5,0,5,5,5,0,0,0,0,0,0,0,5,5,0,5,0,0,0,0,0,0,5,0,"-",0,"-",0,0,5,5,5,0,5,5,0,0,0,0,0,5,0,0,0,5,5,5,5,0,0,5,"-",0,0,"-",0,0,0,5,0,0,"-",5,0]
[]
["Monday, December 29th"]
["Liverpool",null,null,"Swansea City","20:00:00",null,5,5,0,5,0,5,0,5,5,5,5,5,5,5,5,5,5,5,5,5,0,5,5,5,5,5,5,5,0,5,0,5,0,0,"-",5,"-",0,5,0,5,5,5,5,5,5,5,5,5,0,5,0,5,5,5,5,0,5,0,5,5,"-",5,5,"-",5,5,5,0,0,5,"-",0,5]
[]
["Golden Boots"]
["Alexis Sanchez - Arsenal",null,null,null,{"$f":"1+0+0+0+1+0","v":2},{"$f":"COUNT(G91:CB91)","v":14},null,{"$f":"5*$E91","v":10},null,null,null,null,null,{"$f":"5*$E91","v":10},null,null,null,null,null,{"$f":"5*$E91","v":10},null,null,null,null,{"$f":"5*$E91","v":10},{"$f":"5*$E91","v":10},null,null,{"$f":"5*$E91","v":10},null,null,null,null,null,null,null,null,null,null,null,null,null,{"$f":"5*$E91","v":10},null,{"$f":"5*$E91","v":10},null,null,null,null,null,null,{"$f":"5*$E91","v":10},null,null,null,null,null,{"$f":"5*$E91","v":10},null,null,null,null,{"$f":"5*$E91","v":10},{"$f":"5*$E91","v":10},null,null,null,null,null,null,null,null,null,{"$f":"5*$E91","v":10},null,null,null,{"$f":"5*$E91","v":10}]
["Daniel Sturridge - Liverpool",null,null,null,{"$f":"0+0+0+0+0+0","v":0},52,{"$f":"5*$E92","v":0},null,{"$f":"5*$E92","v":0},{"$f":"5*$E92","v":0},{"$f":"5*$E92","v":0},null,{"$f":"5*$E92","v":0},{"$f":"5*$E92","v":0},{"$f":"5*$E92","v":0},{"$f":"5*$E92","v":0},{"$f":"5*$E92","v":0},{"$f":"5*$E92","v":0},{"$f":"5*$E92","v":0},null,null,{"$f":"5*$E92","v":0},{"$f":"5*$E92","v":0},{"$f":"5*$E92","v":0},null,{"$f":"5*$E92","v":0},{"$f":"5*$E92","v":0},{"$f":"5*$E92","v":0},null,null,{"$f":"5*$E92","v":0},{"$f":"5*$E92","v":0},{"$f":"5*$E92","v":0},null,{"$f":"5*$E92","v":0},0,0,0,0,null,0,0,null,{"$f":"5*$E92","v":0},{"$f":"5*$E92","v":0},null,{"$f":"5*$E92","v":0},{"$f":"5*$E92","v":0},null,{"$f":"5*$E92","v":0},{"$f":"5*$E92","v":0},null,{"$f":"5*$E92","v":0},{"$f":"5*$E92","v":0},{"$f":"5*$E92","v":0},{"$f":"5*$E92","v":0},{"$f":"5*$E92","v":0},{"$f":"5*$E92","v":0},null,null,{"$f":"5*$E92","v":0},{"$f":"5*$E92","v":0},{"$f":"5*$E92","v":0},0,{"$f":"5*$E92","v":0},null,null,null,{"$f":"5*$E92","v":0},null,{"$f":"5*$E92","v":0},{"$f":"5*$E92","v":0},{"$f":"5*$E92","v":0},null,{"$f":"5*$E92","v":0},{"$f":"5*$E92","v":0},null,null,{"$f":"5*$E92","v":0},{"$f":"5*$E92","v":0}]
["Diego Costa - Chelsea",null,null,null,{"$f":"0+0+1+0+1+0","v":2},39,null,{"$f":"5*$E93","v":10},null,10,null,{"$f":"5*$E93","v":10},{"$f":"5*$E93","v":10},null,10,{"$f":"5*$E93","v":10},null,null,{"$f":"5*$E93","v":10},{"$f":"5*$E93","v":10},null,null,null,null,null,{"$f":"5*$E93","v":10},null,{"$f":"5*$E93","v":10},{"$f":"5*$E93","v":10},null,10,{"$f":"5*$E93","v":10},{"$f":"5*$E93","v":10},{"$f":"5*$E93","v":10},null,{"$f":"5*$E93","v":10},{"$f":"5*$E93","v":10},null,null,null,{"$f":"5*$E93","v":10},{"$f":"5*$E93","v":10},null,{"$f":"5*$E93","v":10},null,{"$f":"5*$E93","v":10},10,{"$f":"5*$E93","v":10},{"$f":"5*$E93","v":10},null,null,{"$f":"5*$E93","v":10},{"$f":"5*$E93","v":10},{"$f":"5*$E93","v":10},null,{"$f":"5*$E93","v":10},null,{"$f":"5*$E93","v":10},{"$f":"5*$E93","v":10},{"$f":"5*$E93","v":10},{"$f":"5*$E93","v":10},null,null,null,null,{"$f":"5*$E93","v":10},{"$f":"5*$E93","v":10},{"$f":"5*$E93","v":10},null,{"$f":"5*$E93","v":10},null,null,null,null,null,null,null,{"$f":"5*$E93","v":10},{"$f":"5*$E93","v":10},10]
["Eden Hazard - Chelsea",null,null,null,{"$f":"1+0+1+0+0+1","v":3},2,null,null,null,null,{"$f":"5*$E94","v":15},null,null,null,null,null,null,null,null,null,null,null,null,null,null,null,null,null,null,null,null,null,null,null,null,null,null,null,null,null,null,null,null,null,null,null,null,null,null,null,null,null,null,null,null,null,null,null,null,null,null,null,null,null,null,null,null,null,null,null,null,null,null,null,null,{"$f":"5*$E94","v":15}]
["Edin Dzeko - Man City",null,null,null,{"$f":"0+0+0+0+0+0","v":0},6,null,null,null,null,null,{"$f":"5*$E95","v":0},null,null,null,null,null,null,null,null,null,null,null,null,null,null,null,{"$f":"5*$E95","v":0},null,null,null,null,null,null,null,null,null,null,null,null,null,null,{"$f":"5*$E95","v":0},null,null,{"$f":"5*$E95","v":0},null,null,null,null,null,null,null,null,null,null,null,null,null,null,null,null,null,null,null,null,null,{"$f":"5*$E95","v":0},null,null,null,null,null,{"$f":"5*$E95","v":0}]
["Emmanuel Adebayor - Tottenham",null,null,null,{"$f":"0+0+0+0+0+0","v":0},3,null,null,null,null,null,null,null,null,null,null,null,null,null,null,{"$f":"5*$E96","v":0},null,null,null,null,null,null,null,null,null,null,null,null,null,null,null,null,null,null,{"$f":"5*$E96","v":0},null,null,null,null,null,null,null,null,null,null,null,null,null,null,null,null,null,null,null,null,null,null,null,null,null,null,null,null,null,null,{"$f":"5*$E96","v":0}]
["Olivier Giroud - Arsenal",null,null,null,{"$f":"0+0+2+1+0+0","v":3},4,null,null,null,null,null,{"$f":"5*$E97","v":15},null,null,null,null,null,null,null,null,null,null,null,null,null,null,null,null,null,{"$f":"5*$E97","v":15},null,null,null,null,null,null,null,null,null,15,null,null,null,null,null,null,null,{"$f":"5*$E97","v":15}]
["Raheem Sterling - Liverpool",null,null,null,{"$f":"0+0+0+0+1+0","v":1},3,null,null,null,null,null,null,null,null,null,null,null,null,null,null,null,null,null,null,null,null,null,null,null,null,null,null,null,null,null,null,null,null,null,null,null,null,null,null,null,{"$f":"5*$E98","v":5},null,null,null,null,null,null,null,null,null,null,null,null,null,null,null,null,null,null,null,null,null,null,{"$f":"5*$E98","v":5},null,null,null,{"$f":"5*$E98","v":5}]
["Robin van Persie - Man United",null,null,null,{"$f":"0+2+1+0+1+0","v":4},45,{"$f":"5*$E99","v":20},{"$f":"5*$E99","v":20},null,{"$f":"5*$E99","v":20},null,null,null,null,null,{"$f":"5*$E99","v":20},{"$f":"5*$E99","v":20},{"$f":"5*$E99","v":20},{"$f":"5*$E99","v":20},null,{"$f":"5*$E99","v":20},{"$f":"5*$E99","v":20},null,{"$f":"5*$E99","v":20},{"$f":"5*$E99","v":20},null,{"$f":"5*$E99","v":20},null,null,{"$f":"5*$E99","v":20},null,{"$f":"5*$E99","v":20},{"$f":"5*$E99","v":20},{"$f":"5*$E99","v":20},{"$f":"5*$E99","v":20},{"$f":"5*$E99","v":20},null,{"$f":"5*$E99","v":20},{"$f":"5*$E99","v":20},null,null,{"$f":"5*$E99","v":20},{"$f":"5*$E99","v":20},{"$f":"5*$E99","v":20},null,null,{"$f":"5*$E99","v":20},null,{"$f":"5*$E99","v":20},{"$f":"5*$E99","v":20},{"$f":"5*$E99","v":20},null,{"$f":"5*$E99","v":20},{"$f":"5*$E99","v":20},{"$f":"5*$E99","v":20},{"$f":"5*$E99","v":20},{"$f":"5*$E99","v":20},null,{"$f":"5*$E99","v":20},{"$f":"5*$E99","v":20},{"$f":"5*$E99","v":20},{"$f":"5*$E99","v":20},null,null,{"$f":"5*$E99","v":20},{"$f":"5*$E99","v":20},{"$f":"5*$E99","v":20},{"$f":"5*$E99","v":20},null,{"$f":"5*$E99","v":20},null,{"$f":"5*$E99","v":20},null,null,null,{"$f":"5*$E99","v":20},{"$f":"5*$E99","v":20},null,{"$f":"5*$E99","v":20}]
["Romelu Lukaku - Everton",null,null,null,{"$f":"1+0+0+0+0+0","v":1},7,{"$f":"5*$E100","v":5},null,{"$f":"5*$E100","v":5},null,null,null,null,null,null,null,null,null,null,{"$f":"5*$E100","v":5},{"$f":"5*$E100","v":5},null,null,null,null,null,null,null,null,null,null,null,null,null,null,null,null,null,null,null,null,null,null,null,null,null,null,null,null,{"$f":"5*$E100","v":5},null,null,null,null,null,null,null,null,null,null,null,null,null,null,null,null,null,null,null,null,null,null,null,null,null,null,{"$f":"5*$E100","v":5},{"$f":"5*$E100","v":5}]
["Sergio Aguero - Man City",null,null,null,{"$f":"2+0+0+0+0+0","v":2},21,null,null,null,null,null,null,{"$f":"5*$E101","v":10},{"$f":"5*$E101","v":10},null,null,{"$f":"5*$E101","v":10},{"$f":"5*$E101","v":10},null,null,null,null,{"$f":"5*$E101","v":10},{"$f":"5*$E101","v":10},{"$f":"5*$E101","v":10},null,null,null,{"$f":"5*$E101","v":10},{"$f":"5*$E101","v":10},null,null,null,null,{"$f":"5*$E101","v":10},null,{"$f":"5*$E101","v":10},{"$f":"5*$E101","v":10},{"$f":"5*$E101","v":10},{"$f":"5*$E101","v":10},{"$f":"5*$E101","v":10},null,null,null,null,null,null,null,null,null,{"$f":"5*$E101","v":10},null,null,null,{"$f":"5*$E101","v":10},null,null,null,{"$f":"5*$E101","v":10},null,null,{"$f":"5*$E101","v":10},null,null,null,null,{"$f":"5*$E101","v":10},null,null,null,null,null,null,null,{"$f":"5*$E101","v":10}]
["Steven Gerrard - Liverpool",null,null,null,{"$f":"1+0+0+0+0+0","v":1},1,null,null,null,null,null,null,null,null,null,null,null,null,null,null,null,null,null,null,null,null,null,null,null,null,null,null,null,null,null,null,null,null,null,null,null,null,null,null,null,null,null,null,null,null,null,null,null,null,null,null,null,null,null,null,null,null,null,null,null,null,null,null,{"$f":"5*$E102","v":5}]
["Wayne Rooney - Man United",null,null,null,{"$f":"0+0+1+0+2+0","v":3},21,null,null,{"$f":"5*$E103","v":15},null,{"$f":"5*$E103","v":15},null,null,null,{"$f":"5*$E103","v":15},null,null,null,null,null,null,{"$f":"5*$E103","v":15},{"$f":"5*$E103","v":15},null,null,null,{"$f":"5*$E103","v":15},null,null,null,null,null,null,null,null,null,null,null,null,null,null,null,null,null,{"$f":"5*$E103","v":15},null,null,null,{"$f":"5*$E103","v":15},null,null,{"$f":"5*$E103","v":15},null,null,null,null,{"$f":"5*$E103","v":15},null,null,{"$f":"5*$E103","v":15},null,null,{"$f":"5*$E103","v":15},{"$f":"5*$E103","v":15},{"$f":"5*$E103","v":15},{"$f":"5*$E103","v":15},null,null,null,null,{"$f":"5*$E103","v":15},null,{"$f":"5*$E103","v":15},{"$f":"5*$E103","v":15},{"$f":"5*$E103","v":15},null,{"$f":"5*$E103","v":15},null,null,{"$f":"5*$E103","v":15}]
["Wilfried Bony - Swansea City",null,null,null,{"$f":"0+1+1+0+0+0","v":2},1,null,null,null,null,null,null,null,null,null,null,null,null,null,null,null,null,null,null,null,null,null,null,null,null,null,null,null,{"$f":"5*$E104","v":10}]
["Yaya Toure - Man City",null,null,null,{"$f":"1+1+0+1+1+0","v":4},3,null,null,null,null,null,null,null,null,null,null,null,null,null,null,null,null,null,null,null,null,null,null,null,null,{"$f":"5*$E105","v":20},null,null,null,null,null,null,null,null,null,null,null,null,null,null,null,null,null,null,null,null,null,null,null,null,null,null,null,null,null,null,null,null,null,null,null,null,null,null,{"$f":"5*$E105","v":20},null,{"$f":"5*$E105","v":20}]
[]
[]
["Sack Race"]
["Alan Irvine - West Brom",null,null,null,null,{"$f":"COUNT(G109:CB109)","v":5},null,null,null,null,null,null,{"$f":"25*$E109","v":0},null,null,null,null,null,{"$f":"25*$E109","v":0},null,null,null,null,null,null,null,null,null,null,null,null,null,{"$f":"25*$E109","v":0},null,null,null,null,null,null,null,null,null,null,null,null,null,null,null,null,null,null,null,null,null,null,null,null,null,null,null,null,null,{"$f":"25*$E109","v":0},null,null,null,null,null,null,null,null,null,{"$f":"25*$E109","v":0}]
["Alan Pardew - Newcastle",null,null,null,null,8,{"$f":"25*$E110","v":0},null,null,null,{"$f":"25*$E110","v":0},null,null,null,null,null,null,null,null,null,{"$f":"25*$E110","v":0},{"$f":"25*$E110","v":0},null,null,null,null,null,null,null,null,null,null,null,null,null,null,{"$f":"25*$E110","v":0},null,null,null,null,null,null,null,null,null,null,null,null,null,{"$f":"25*$E110","v":0},null,null,null,null,null,null,null,null,null,null,null,null,null,null,null,{"$f":"25*$E110","v":0},null,null,null,null,null,null,null,null,null,null,null,null,{"$f":"25*$E110","v":0}]
["Arsene Wenger - Arsenal",null,null,null,null,0]
["Brendan Rodgers - Liverpool",null,null,null,null,0]
["Garry Monk - Swansea City",null,null,null,null,6,null,null,null,null,null,null,null,null,null,null,null,null,null,null,null,null,null,null,null,null,{"$f":"25*$E113","v":0},{"$f":"25*$E113","v":0},null,null,null,null,null,null,null,null,null,null,null,null,null,null,null,null,null,null,null,null,{"$f":"25*$E113","v":0},null,null,null,{"$f":"25*$E113","v":0},null,{"$f":"25*$E113","v":0},null,null,null,null,null,null,null,null,{"$f":"25*$E113","v":0}]
["Gus Poyet - Sunderland",null,null,null,null,0]
["Harry Redknapp - QPR",null,null,null,null,2,null,null,null,null,null,null,null,null,null,null,null,null,null,null,null,null,null,null,null,null,null,null,null,null,null,null,null,null,null,null,null,null,null,{"$f":"25*$E115","v":0},null,null,null,null,null,null,null,null,null,null,null,null,null,null,null,null,null,null,null,null,null,null,null,null,null,null,null,null,null,{"$f":"25*$E115","v":0}]
["Jose Mourinho - Chelsea",null,null,null,null,0]
["Louis van Gaal - Man United",null,null,null,null,1,null,null,null,null,null,null,null,null,null,null,null,null,null,null,null,null,null,null,null,null,null,null,null,null,null,null,null,null,null,null,null,null,null,null,null,null,null,null,null,null,null,null,null,null,null,null,null,null,null,null,null,null,null,null,null,null,null,null,null,null,null,null,{"$f":"25*$E117","v":0}]
["Manuel Pellegrini - Man City",null,null,null,null,0]
["Mark Hughes - Stoke City",null,null,null,null,0]
["Mauricio Pochettino - Tottenham",null,null,null,null,0]
["Nigel Pearson - Leicester City",null,null,null,null,3,null,null,null,null,null,{"$f":"25*$E121","v":0},null,null,null,null,null,null,null,null,null,null,null,null,null,null,null,null,null,null,null,{"$f":"25*$E121","v":0},null,null,null,{"$f":"25*$E121","v":0}]
["Paul Lambert - Aston Villa",null,null,null,null,13,null,null,null,null,null,null,null,null,null,null,null,null,null,{"$f":"25*$E122","v":0},null,null,null,null,{"$f":"25*$E122","v":0},{"$f":"25*$E122","v":0},null,null,null,{"$f":"25*$E122","v":0},{"$f":"25*$E122","v":0},null,null,null,null,null,null,{"$f":"25*$E122","v":0},{"$f":"25*$E122","v":0},null,null,null,null,null,{"$f":"25*$E122","v":0},{"$f":"25*$E122","v":0},null,{"$f":"25*$E122","v":0},null,{"$f":"25*$E122","v":0},null,null,null,{"$f":"25*$E122","v":0},null,null,null,null,null,null,null,null,null,null,{"$f":"25*$E122","v":0}]
["Roberto Martinez - Everton",null,null,null,null,0]
["Ronald Koeman - Southampton",null,null,null,null,4,null,null,null,null,null,null,null,null,null,null,null,{"$f":"25*$E124","v":0},null,null,null,null,null,null,null,null,null,null,null,null,null,null,null,null,null,null,null,null,null,null,null,{"$f":"25*$E124","v":0},null,null,null,null,null,null,null,null,null,null,null,null,null,null,null,null,null,null,null,null,null,null,null,null,null,{"$f":"25*$E124","v":0},null,null,null,null,null,{"$f":"25*$E124","v":0}]
["Sam Allardyce - West Ham",null,null,null,null,27,null,null,{"$f":"25*$E125","v":0},{"$f":"25*$E125","v":0},null,null,null,{"$f":"25*$E125","v":0},{"$f":"25*$E125","v":0},{"$f":"25*$E125","v":0},{"$f":"25*$E125","v":0},null,null,null,null,null,{"$f":"25*$E125","v":0},{"$f":"25*$E125","v":0},null,null,null,null,{"$f":"25*$E125","v":0},null,null,null,null,{"$f":"25*$E125","v":0},{"$f":"25*$E125","v":0},null,null,null,null,null,{"$f":"25*$E125","v":0},null,{"$f":"25*$E125","v":0},{"$f":"25*$E125","v":0},null,null,{"$f":"25*$E125","v":0},null,null,null,null,{"$f":"25*$E125","v":0},null,null,null,{"$f":"25*$E125","v":0},{"$f":"25*$E125","v":0},null,null,{"$f":"25*$E125","v":0},{"$f":"25*$E125","v":0},null,null,null,null,{"$f":"25*$E125","v":0},null,null,null,null,{"$f":"25*$E125","v":0},{"$f":"25*$E125","v":0},null,null,{"$f":"25*$E125","v":0},{"$f":"25*$E125","v":0},{"$f":"25*$E125","v":0},null,{"$f":"25*$E125","v":0}]
["Sean Dyche - Burnley",null,null,null,null,4,null,{"$f":"25*$E126","v":0},null,null,null,null,null,null,null,null,null,null,null,null,null,null,null,null,null,null,null,null,null,null,null,null,null,null,null,null,null,null,null,null,null,null,null,null,null,null,null,null,null,null,null,null,null,null,null,null,null,{"$f":"25*$E126","v":0},{"$f":"25*$E126","v":0},null,null,{"$f":"25*$E126","v":0}]
["Steve Bruce - Hull City",null,null,null,null,1,null,null,null,null,null,null,null,null,null,null,null,null,null,null,null,null,null,null,null,null,null,null,null,null,null,null,null,null,null,null,null,null,null,null,null,null,null,null,null,null,null,null,null,null,null,null,null,null,null,null,null,null,null,null,null,null,null,null,null,null,null,null,null,null,null,null,null,null,null,null,null,{"$f":"25*$E127","v":0}]
[]
["Total Points - December",null,null,null,null,null,{"$f":"SUM(G2:G128)","v":215},{"$f":"SUM(H2:H128)","v":230},185,190,205,175,260,205,215,265,200,215,250,205,205,205,210,235,250,215,245,230,210,235,135,245,220,270,245,235,215,220,250,215,20,225,55,180,245,205,230,195,240,220,200,190,230,170,190,215,215,225,240,250,210,230,90,200,245,245,245,120,125,260,15,{"$f":"SUM(BT2:BT128)","v":210},200,245,240,245,200,70,240,225]
[]
[null,null,null,null,null,null,{"$f":"IF(COUNT(G90:G128)=4,\"a\",\"g\")","v":"a"},"a","a","a","a","a","a","a","a","a","a","a","a","a","a","a","a","a","a","a","a","a","a","a","a","a","a","a","a","a","a","a","a","a","a","a","a","a","a","a","a","a","a","a","a","a","a","a","a","a","a","a","a","a","a","a","a","a","a","a","a","a","a","a",{"$f":"IF(COUNT(BS90:BS128)=4,\"a\",\"g\")","v":"a"},"a","a","a","a","a","a","a","a","a"]

{"sheet":"January","index":6,"n_rows":73,"n_cols":80,"rows_kept":73,"cut":false,"hidden":false,"merged":[[40,0,40,4],[43,0,43,4],[1,0,1,4],[13,0,13,4],[23,0,23,4],[27,0,27,4],[36,0,36,4]]}
[null,null,null,null,null,null,"Aaron Byrne","Aidan Knight","Aidan Scanlon","Aidan White","Aiden Desch","Alan Boyle","Anastas Popov","Andy Dunne","Anthony Hughes","Barry Healy","Brendan Maguire","Brian Mullen","Brian Prendergast","Brian Sotolongo","Chris Hall","Ciaran O'Hart","Cillian Conway","Colin McAnaspie","Con McSweeney","Conor Horan","Craig Calvert","Dave Green","Dave McGinley","David Bone","David Byrne","David Cooney","David Keavney","Eamon Fox","Fiachra Moynihan","Gareth Pierpoint","Gary McGurk","Gavin Morgan","Gerry Draper","Gerry Moore","Ian Healy","Javier Suarez Barreiro","Jenny Ellis","Joe Behan","Joe O'Hehir","Joe Turner","Jonathan Fox","Keith Horan","Kevin Donohoe","Kevin Philpott","Konstantin Kulev","Kris Stainton","Liam Butler","Liam Geraghty","Maria Jordan","Mike Hall","Niall Carroll","Oisin O'Reilly","Padraic Carney","Pat Jordan","Paul Moore","Paul Prendergast","Paul Stainton","Peter Behan","Phil Doyle","Philip Jordan","Ralph Goodwin","Ray Ellis","Rhona Devlin","Richard Johnston","Sean Moloney","Sean O'Mairtin","Shane Horan","Sharon Behan","Simon Purdue","Siobhan Murphy","Terry Behan","Tiago Moreira","Tom McHugh","Wayne Donovan"]
["Thursday, January 1st"]
["Stoke City",1,1,"Man United","12:45:00",null,0,0,0,0,0,0,0,0,0,0,0,0,0,10,0,0,0,0,0,0,0,0,0,0,10,0,0,0,0,5,0,0,10,10,"-",0,"-",0,0,5,0,0,0,0,0,0,0,10,0,0,0,0,0,0,0,10,0,0,0,0,0,0,0,0,"-",10,10,0,0,0,10,"-",0,0]
["Aston Villa",0,0,"Crystal Palace","15:00:00",null,0,0,0,5,0,0,0,0,0,0,0,0,0,0,0,5,0,0,10,0,0,0,5,5,0,0,0,0,0,10,0,0,10,0,"-",0,"-",0,0,0,0,0,0,5,0,0,0,0,5,0,0,0,0,0,0,0,0,0,0,5,0,0,0,0,"-",0,0,0,0,0,0,"-",10,0]
["Hull City",2,0,"Everton","15:00:00",null,0,0,0,5,0,0,5,0,0,0,0,10,0,0,10,0,0,0,0,0,0,0,0,0,0,0,5,0,0,0,0,0,0,0,"-",0,"-",5,0,5,0,10,5,0,0,0,0,10,0,0,0,0,0,0,0,0,0,0,0,0,5,5,0,0,"-",0,0,0,0,0,0,"-",0,0]
["Liverpool",2,2,"Leicester City","15:00:00",null,0,0,0,0,5,0,0,0,0,0,0,0,0,0,0,0,0,0,0,0,0,0,0,0,0,0,0,0,0,0,0,0,0,0,"-",0,"-",0,0,0,0,0,0,0,0,0,0,0,0,0,5,0,0,0,0,0,0,0,0,0,0,0,0,0,"-",0,0,0,0,0,0,"-",0,0]
["Man City",3,2,"Sunderland","15:00:00",null,5,5,5,5,5,5,5,5,5,5,5,5,5,5,5,5,5,5,5,10,5,5,5,5,5,5,5,5,5,5,5,5,5,5,"-",5,"-",5,5,5,5,5,5,5,5,5,5,0,5,5,5,5,5,5,5,5,0,5,5,5,5,5,5,5,"-",5,5,5,5,5,5,"-",0,5]
["Newcastle United",3,3,"Burnley","15:00:00",null,0,0,0,0,5,0,0,0,5,0,0,0,0,0,0,0,0,0,0,0,0,0,0,0,0,5,0,0,0,0,0,0,0,5,"-",0,"-",0,0,0,0,0,5,0,0,0,5,0,0,5,0,0,5,0,0,0,0,0,5,0,0,0,5,0,"-",0,0,0,0,0,0,"-",0,0]
["QPR",1,1,"Swansea City","15:00:00",null,0,0,0,10,0,0,0,10,0,0,0,0,0,0,10,0,10,0,0,10,0,5,5,10,10,0,0,10,5,0,5,0,10,10,"-",10,"-",0,0,5,5,0,0,10,10,10,0,0,0,0,0,0,0,0,10,0,0,0,0,10,0,0,0,0,"-",5,0,0,0,10,0,"-",0,0]
["Southampton",2,0,"Arsenal","15:00:00",null,0,0,5,0,5,5,5,5,0,0,0,10,0,0,0,0,0,0,0,0,0,0,0,0,10,0,5,5,0,0,0,5,0,0,"-",0,"-",0,0,0,0,10,0,0,0,0,0,0,0,0,0,0,0,0,0,0,10,0,5,0,0,0,0,0,"-",10,0,0,0,0,0,"-",0,0]
["West Ham United",1,1,"West Brom","15:00:00",null,0,0,0,10,0,0,0,0,0,0,0,0,0,0,0,0,0,0,0,0,0,0,0,0,0,0,0,0,0,0,0,0,0,0,"-",0,"-",0,0,0,0,0,0,0,0,0,0,0,0,0,0,0,0,0,0,0,0,0,5,0,0,5,5,0,"-",0,0,0,0,0,0,"-",0,0]
["Tottenham",5,3,"Chelsea","17:30:00",null,0,0,0,0,5,0,0,0,0,0,0,5,0,0,0,0,0,0,0,0,0,0,0,0,0,0,0,0,0,0,0,0,0,0,"-",0,"-",0,0,0,0,5,0,0,0,0,0,0,0,0,0,0,0,0,0,0,0,0,0,0,0,0,0,0,"-",0,0,0,0,0,0,"-",0,0]
[]
["Saturday, January 10th"]
["Sunderland",0,1,"Liverpool","12:45:00",null,0,10,5,10,0,0,0,5,5,5,0,0,0,0,0,0,0,5,0,5,5,0,0,0,5,0,0,0,0,5,5,0,0,0,"-",10,"-",0,0,0,10,"-",0,10,0,0,5,5,10,10,0,5,0,5,5,0,5,"-",5,0,10,"-",5,5,"-",5,5,5,0,0,0,"-",5,0]
["Burnley",2,1,"QPR","15:00:00",null,0,5,0,5,5,0,5,0,10,5,0,5,5,0,5,5,5,0,10,0,10,0,5,5,5,10,10,5,10,5,0,5,10,5,"-",0,"-",5,0,10,5,"-",10,0,5,0,5,0,0,0,0,0,5,0,10,5,0,"-",0,0,0,5,0,0,"-",10,0,0,10,10,10,"-",5,10]
["Chelsea",2,0,"Newcastle United","15:00:00",null,10,5,5,10,5,5,10,10,5,10,5,10,10,5,5,10,5,5,5,10,5,5,5,10,5,5,5,5,5,5,10,10,10,5,"-",5,"-",5,5,10,10,"-",5,10,10,5,5,10,5,5,10,5,10,5,5,5,5,"-",5,5,10,5,0,5,"-",5,5,10,10,5,5,"-",5,10]
["Everton",1,1,"Man City","15:00:00",null,0,0,0,0,0,10,0,0,0,0,0,0,0,0,0,0,0,0,0,0,0,0,0,0,0,0,0,0,0,0,0,0,0,0,"-",0,"-",0,0,0,0,"-",0,0,0,0,0,10,0,0,10,0,0,0,5,0,5,"-",0,0,0,0,5,0,"-",10,0,0,0,0,0,"-",0,10]
["Leicester City",1,0,"Aston Villa","15:00:00",null,0,10,0,0,10,5,0,0,0,0,5,0,5,5,10,10,0,0,5,0,5,0,0,0,10,0,0,0,10,0,10,0,0,10,"-",0,"-",5,0,5,10,"-",5,0,0,0,0,5,10,0,0,0,10,5,5,0,5,"-",0,0,0,0,0,0,"-",0,10,0,0,0,0,"-",0,0]
["Swansea City",1,1,"West Ham United","15:00:00",null,0,10,0,0,0,10,0,10,10,0,0,0,0,10,0,5,10,0,10,10,5,10,0,0,0,0,0,10,0,0,10,0,10,10,"-",10,"-",10,0,0,0,"-",10,0,10,0,0,10,10,0,10,5,5,0,0,0,0,"-",0,0,0,0,0,10,"-",5,0,5,0,0,0,"-",5,10]
["West Brom",1,0,"Hull City","15:00:00",null,5,0,5,0,0,5,5,0,5,5,5,0,5,0,5,10,5,0,5,0,10,0,5,5,5,0,0,10,5,10,10,5,5,10,"-",5,"-",0,0,5,10,"-",5,10,10,0,0,0,10,10,5,0,5,5,0,10,5,"-",0,5,5,10,0,10,"-",10,0,0,5,5,10,"-",0,5]
["Crystal Palace",2,1,"Tottenham","17:30:00",null,0,0,0,0,0,0,0,0,0,0,0,0,0,0,0,0,0,0,5,0,0,0,0,0,0,5,0,0,0,0,0,0,0,0,"-",0,"-",0,0,10,0,"-",5,0,0,0,0,0,0,5,0,0,5,0,0,0,0,"-",0,0,0,0,0,0,"-",0,0,0,0,0,0,"-",5,0]
[]
["Sunday, January 11th"]
["Arsenal",3,0,"Stoke City","13:30:00",null,5,5,5,5,0,5,5,5,0,5,5,5,5,5,10,5,5,5,5,5,5,0,5,10,5,5,5,5,5,5,5,5,5,5,"-",10,"-",0,5,5,5,"-",5,5,10,5,5,5,5,5,5,5,5,5,5,5,0,"-",5,5,5,0,5,5,"-",5,5,5,5,5,5,"-",5,5]
["Man United",0,1,"Southampton","16:00:00",null,0,0,0,0,0,0,0,0,0,0,0,0,0,0,0,0,0,0,0,0,0,0,0,0,0,0,0,0,0,0,0,0,0,5,"-",0,"-",10,0,0,0,"-",0,0,0,0,0,0,0,0,0,0,0,0,0,0,0,"-",0,0,0,0,0,0,"-",0,0,0,0,0,0,"-",0,0]
[]
["Saturday, January 17th"]
["Aston Villa",0,2,"Liverpool","15:00:00",null,5,5,0,10,0,5,0,5,5,5,0,5,0,5,5,10,5,5,5,5,10,5,5,0,10,10,5,5,5,5,5,5,5,10,"-",5,"-",5,5,0,5,"-",0,5,5,5,0,5,5,5,0,5,0,5,10,10,"-","-",5,0,5,5,5,5,"-",5,5,5,0,0,5,10,"-",5]
["Burnley",2,3,"Crystal Palace","15:00:00",null,0,0,5,0,0,0,0,0,0,0,0,0,0,0,0,0,0,0,0,0,0,0,0,5,0,0,0,0,0,0,0,0,0,0,"-",0,"-",0,0,0,0,"-",0,0,0,0,5,5,0,0,0,0,0,0,0,0,"-","-",0,0,0,0,5,0,"-",0,5,0,0,0,0,0,"-",0]
["Leicester City",0,1,"Stoke City","15:00:00",null,0,0,0,0,0,0,0,0,0,10,5,10,0,5,0,0,0,10,0,0,0,0,0,0,0,0,0,0,0,0,0,10,0,0,"-",0,"-",0,5,0,0,"-",0,10,0,10,0,5,0,0,0,10,0,5,0,0,"-","-",0,0,0,0,0,0,"-",0,0,10,5,0,0,0,"-",0]
["QPR",0,2,"Man United","15:00:00",null,10,5,5,5,0,5,5,5,10,5,5,5,0,10,5,0,10,10,10,5,5,5,5,5,0,5,5,5,5,5,10,10,0,0,"-",5,"-",10,5,10,10,"-",5,10,5,5,5,0,5,5,5,5,5,5,5,5,"-","-",5,5,10,5,5,5,"-",0,5,10,5,10,5,10,"-",0]
["Swansea City",0,5,"Chelsea","15:00:00",null,5,5,5,5,5,5,5,5,0,5,5,5,5,5,5,5,5,5,5,5,5,5,5,5,5,5,5,5,5,5,5,5,5,5,"-",5,"-",5,5,5,5,"-",5,5,5,5,5,5,5,5,5,5,5,5,5,5,"-","-",5,5,5,5,0,5,"-",5,5,5,5,5,5,5,"-",5]
["Tottenham",2,1,"Sunderland","15:00:00",null,5,5,10,5,5,10,5,5,10,5,5,5,5,10,5,5,5,5,5,10,5,10,5,0,5,5,10,5,5,5,5,10,5,5,"-",0,"-",5,5,5,5,"-",5,10,5,5,5,5,5,5,5,5,5,5,5,5,"-","-",10,10,5,10,5,10,"-",5,5,5,10,10,5,10,"-",10]
["Newcastle United",1,2,"Southampton","17:30:00",null,10,0,10,0,0,0,0,10,5,5,0,0,10,0,5,0,0,0,10,0,0,5,5,10,10,5,10,5,0,5,0,0,5,5,"-",0,"-",10,10,0,5,"-",0,0,5,10,5,10,0,0,10,10,0,10,0,0,"-","-",10,0,5,0,0,10,"-",10,10,5,10,0,0,0,"-",0]
[]
["Sunday, January 18th"]
["West Ham",3,0,"Hull City","13:30:00",null,5,5,5,5,5,5,5,5,5,5,5,0,5,5,5,0,5,5,5,5,5,5,5,5,5,5,5,5,5,10,5,5,5,5,"-",5,"-",5,5,5,5,"-",5,5,5,5,5,0,5,5,5,5,5,5,0,5,"-","-",5,5,5,0,5,5,"-",5,0,5,5,5,10,0,"-",5]
["Man City",0,2,"Arsenal","16:00:00",null,0,0,0,0,0,0,0,0,0,0,0,0,0,0,0,0,0,0,0,0,0,0,0,0,0,0,0,0,0,0,0,0,0,0,"-",0,"-",0,0,0,0,"-",0,0,0,0,0,0,0,0,0,0,0,0,0,0,"-","-",0,0,0,0,0,0,"-",0,0,0,0,0,0,0,"-",0]
[]
["Monday, January 19th"]
["Everton",0,0,"West Brom","20:00:00",null,0,0,5,5,0,0,0,0,0,0,0,0,0,0,0,0,5,0,0,0,0,0,0,0,5,0,0,0,0,0,0,0,0,0,"-",0,"-",0,0,5,0,"-",0,0,5,5,0,0,5,0,5,5,0,0,5,0,"-","-",0,0,0,0,0,0,"-",0,0,0,5,0,10,0,"-",0]
[]
["Saturday, January 31st"]
["Hull City",0,3,"Newcastle United","12:45:00",null,0,0,0,0,0,0,0,0,5,5,0,0,0,5,0,0,0,0,0,0,0,5,0,5,0,0,0,0,0,0,0,0,0,0,"-",5,"-",0,0,0,5,"-",0,0,"-",0,0,0,5,5,"-",5,0,5,0,5,"-","-",0,0,0,5,0,0,"-",0,0,0,0,5,0,"-",0,0]
["Crystal Palace",0,1,"Everton","15:00:00",null,0,5,0,0,0,5,0,0,0,0,0,5,0,0,5,0,0,10,0,5,0,0,0,0,0,0,0,0,0,0,0,0,10,0,"-",0,"-",0,0,0,0,"-",0,0,10,0,0,0,0,0,0,5,0,5,0,0,"-","-",0,0,0,0,5,5,"-",0,0,0,0,0,0,"-",5,0]
["Liverpool",2,0,"West Ham","15:00:00",null,5,5,5,5,5,5,5,10,5,5,0,5,5,0,5,5,5,10,5,5,0,0,0,5,5,0,5,5,5,5,5,5,0,5,"-",5,"-",0,5,0,5,"-",5,5,10,0,0,5,5,0,0,5,5,5,10,10,"-","-",0,5,5,5,10,5,"-",5,5,0,5,0,5,"-",5,0]
["Man United",3,1,"Leicester City","15:00:00",null,5,5,5,5,5,5,5,5,5,5,10,5,5,5,5,5,10,5,5,5,5,5,5,10,5,5,5,5,5,5,5,5,5,5,"-",5,"-",5,10,5,5,"-",10,5,5,5,5,5,5,5,5,5,5,10,5,5,"-","-",10,5,5,5,5,5,"-",10,5,5,5,5,5,"-",5,5]
["Stoke City",3,1,"QPR","15:00:00",null,5,5,5,5,5,5,5,5,5,5,5,0,5,5,5,5,5,5,5,5,5,5,5,5,5,5,5,5,0,5,5,5,5,5,"-",0,"-",5,5,5,5,"-",0,5,5,5,5,5,0,0,5,0,5,5,5,5,"-","-",5,0,5,5,0,5,"-",5,5,5,5,0,0,"-",0,5]
["Sunderland",2,0,"Burnley","15:00:00",null,5,5,10,0,5,5,10,0,5,0,0,5,5,5,0,5,0,5,0,0,0,5,0,5,0,5,5,5,5,0,5,5,5,5,"-",5,"-",0,10,5,5,"-",5,5,5,5,0,"-",5,5,0,5,0,5,0,10,"-","-",10,5,10,5,0,5,"-",5,5,0,5,5,0,"-",5,5]
["West Brom",0,3,"Tottenham","15:00:00",null,0,5,0,5,0,5,5,0,5,5,5,5,0,5,0,0,5,5,5,5,0,5,0,0,0,5,5,0,0,0,0,5,5,0,"-",5,"-",0,0,0,5,"-",0,0,0,5,5,"-",5,0,0,5,0,5,5,5,"-","-",5,5,0,5,5,5,"-",0,0,0,0,0,0,"-",0,0]
["Chelsea",1,1,"Man City","17:30:00",null,0,0,0,0,0,10,0,0,0,0,10,5,5,0,0,10,10,0,10,0,0,0,0,0,0,0,0,10,10,0,0,0,0,0,"-",0,"-",0,0,0,0,"-",10,0,0,5,0,"-",0,0,10,0,10,0,0,0,"-","-",5,0,10,0,5,0,"-",5,0,0,0,10,10,"-",0,0]
[]
["Golden Boots"]
["Alexis Sanchez - Arsenal",null,null,null,{"$f":"0+2+0","v":2},{"$f":"COUNT(G55:CB55)","v":14},null,{"$f":"5*$E55","v":10},null,null,null,null,null,{"$f":"5*$E55","v":10},null,null,null,null,null,{"$f":"5*$E55","v":10},null,null,null,null,{"$f":"5*$E55","v":10},{"$f":"5*$E55","v":10},null,null,{"$f":"5*$E55","v":10},null,null,null,null,null,null,null,null,null,null,null,null,null,{"$f":"5*$E55","v":10},null,{"$f":"5*$E55","v":10},null,null,null,null,null,null,{"$f":"5*$E55","v":10},null,null,null,null,null,{"$f":"5*$E55","v":10},null,null,null,null,{"$f":"5*$E55","v":10},{"$f":"5*$E55","v":10},null,null,null,null,null,null,null,null,null,{"$f":"5*$E55","v":10},null,null,null,{"$f":"5*$E55","v":10}]
["Daniel Sturridge - Liverpool",null,null,null,{"$f":"0+0+0+1","v":1},52,{"$f":"5*$E56","v":5},null,{"$f":"5*$E56","v":5},{"$f":"5*$E56","v":5},{"$f":"5*$E56","v":5},null,{"$f":"5*$E56","v":5},{"$f":"5*$E56","v":5},{"$f":"5*$E56","v":5},{"$f":"5*$E56","v":5},{"$f":"5*$E56","v":5},{"$f":"5*$E56","v":5},{"$f":"5*$E56","v":5},null,null,{"$f":"5*$E56","v":5},{"$f":"5*$E56","v":5},{"$f":"5*$E56","v":5},null,{"$f":"5*$E56","v":5},{"$f":"5*$E56","v":5},{"$f":"5*$E56","v":5},null,null,{"$f":"5*$E56","v":5},{"$f":"5*$E56","v":5},{"$f":"5*$E56","v":5},null,{"$f":"5*$E56","v":5},5,5,5,5,null,5,5,null,{"$f":"5*$E56","v":5},{"$f":"5*$E56","v":5},null,{"$f":"5*$E56","v":5},{"$f":"5*$E56","v":5},null,{"$f":"5*$E56","v":5},{"$f":"5*$E56","v":5},null,{"$f":"5*$E56","v":5},{"$f":"5*$E56","v":5},{"$f":"5*$E56","v":5},{"$f":"5*$E56","v":5},{"$f":"5*$E56","v":5},{"$f":"5*$E56","v":5},null,null,{"$f":"5*$E56","v":5},{"$f":"5*$E56","v":5},{"$f":"5*$E56","v":5},5,{"$f":"5*$E56","v":5},null,null,null,{"$f":"5*$E56","v":5},null,{"$f":"5*$E56","v":5},{"$f":"5*$E56","v":5},{"$f":"5*$E56","v":5},null,{"$f":"5*$E56","v":5},{"$f":"5*$E56","v":5},null,null,{"$f":"5*$E56","v":5},{"$f":"5*$E56","v":5}]
["Diego Costa - Chelsea",null,null,null,{"$f":"1+1+2+0","v":4},39,null,{"$f":"5*$E57","v":20},null,20,null,{"$f":"5*$E57","v":20},{"$f":"5*$E57","v":20},null,20,{"$f":"5*$E57","v":20},null,null,{"$f":"5*$E57","v":20},{"$f":"5*$E57","v":20},null,null,null,null,null,{"$f":"5*$E57","v":20},null,{"$f":"5*$E57","v":20},{"$f":"5*$E57","v":20},null,20,{"$f":"5*$E57","v":20},{"$f":"5*$E57","v":20},{"$f":"5*$E57","v":20},null,{"$f":"5*$E57","v":20},{"$f":"5*$E57","v":20},null,null,null,{"$f":"5*$E57","v":20},{"$f":"5*$E57","v":20},null,{"$f":"5*$E57","v":20},null,{"$f":"5*$E57","v":20},20,{"$f":"5*$E57","v":20},{"$f":"5*$E57","v":20},null,null,{"$f":"5*$E57","v":20},{"$f":"5*$E57","v":20},{"$f":"5*$E57","v":20},null,{"$f":"5*$E57","v":20},null,{"$f":"5*$E57","v":20},{"$f":"5*$E57","v":20},{"$f":"5*$E57","v":20},{"$f":"5*$E57","v":20},null,null,null,null,{"$f":"5*$E57","v":20},{"$f":"5*$E57","v":20},{"$f":"5*$E57","v":20},null,{"$f":"5*$E57","v":20},null,null,null,null,null,null,null,{"$f":"5*$E57","v":20},{"$f":"5*$E57","v":20},20]
["Eden Hazard - Chelsea",null,null,null,{"$f":"1+0+0+0","v":1},2,null,null,null,null,{"$f":"5*$E58","v":5},null,null,null,null,null,null,null,null,null,null,null,null,null,null,null,null,null,null,null,null,null,null,null,null,null,null,null,null,null,null,null,null,null,null,null,null,null,null,null,null,null,null,null,null,null,null,null,null,null,null,null,null,null,null,null,null,null,null,null,null,null,null,null,null,{"$f":"5*$E58","v":5}]
["Edin Dzeko - Man City",null,null,null,{"$f":"0+0+0+0","v":0},6,null,null,null,null,null,{"$f":"5*$E59","v":0},null,null,null,null,null,null,null,null,null,null,null,null,null,null,null,{"$f":"5*$E59","v":0},null,null,null,null,null,null,null,null,null,null,null,null,null,null,{"$f":"5*$E59","v":0},null,null,{"$f":"5*$E59","v":0},null,null,null,null,null,null,null,null,null,null,null,null,null,null,null,null,null,null,null,null,null,{"$f":"5*$E59","v":0},null,null,null,null,null,{"$f":"5*$E59","v":0}]
["Emmanuel Adebayor - Tottenham",null,null,null,{"$f":"0+0+0+0","v":0},3,null,null,null,null,null,null,null,null,null,null,null,null,null,null,{"$f":"5*$E60","v":0},null,null,null,null,null,null,null,null,null,null,null,null,null,null,null,null,null,null,{"$f":"5*$E60","v":0},null,null,null,null,null,null,null,null,null,null,null,null,null,null,null,null,null,null,null,null,null,null,null,null,null,null,null,null,null,null,{"$f":"5*$E60","v":0}]
["Olivier Giroud - Arsenal",null,null,null,{"$f":"0+0+1","v":1},4,null,null,null,null,null,{"$f":"5*$E61","v":5},null,null,null,null,null,null,null,null,null,null,null,null,null,null,null,null,null,{"$f":"5*$E61","v":5},null,null,null,null,null,null,null,null,null,5,null,null,null,null,null,null,null,{"$f":"5*$E61","v":5}]
["Raheem Sterling - Liverpool",null,null,null,{"$f":"0+0+0+1","v":1},3,null,null,null,null,null,null,null,null,null,null,null,null,null,null,null,null,null,null,null,null,null,null,null,null,null,null,null,null,null,null,null,null,null,null,null,null,null,null,null,{"$f":"5*$E62","v":5},null,null,null,null,null,null,null,null,null,null,null,null,null,null,null,null,null,null,null,null,null,null,{"$f":"5*$E62","v":5},null,null,null,{"$f":"5*$E62","v":5}]
["Robin van Persie - Man United",null,null,null,{"$f":"0+0+0+1","v":1},45,{"$f":"5*$E63","v":5},{"$f":"5*$E63","v":5},null,{"$f":"5*$E63","v":5},null,null,null,null,null,{"$f":"5*$E63","v":5},{"$f":"5*$E63","v":5},{"$f":"5*$E63","v":5},{"$f":"5*$E63","v":5},null,{"$f":"5*$E63","v":5},{"$f":"5*$E63","v":5},null,{"$f":"5*$E63","v":5},{"$f":"5*$E63","v":5},null,{"$f":"5*$E63","v":5},null,null,{"$f":"5*$E63","v":5},null,{"$f":"5*$E63","v":5},{"$f":"5*$E63","v":5},{"$f":"5*$E63","v":5},{"$f":"5*$E63","v":5},{"$f":"5*$E63","v":5},null,{"$f":"5*$E63","v":5},{"$f":"5*$E63","v":5},null,null,{"$f":"5*$E63","v":5},{"$f":"5*$E63","v":5},{"$f":"5*$E63","v":5},null,null,{"$f":"5*$E63","v":5},null,{"$f":"5*$E63","v":5},{"$f":"5*$E63","v":5},{"$f":"5*$E63","v":5},null,{"$f":"5*$E63","v":5},{"$f":"5*$E63","v":5},{"$f":"5*$E63","v":5},{"$f":"5*$E63","v":5},{"$f":"5*$E63","v":5},null,{"$f":"5*$E63","v":5},{"$f":"5*$E63","v":5},{"$f":"5*$E63","v":5},{"$f":"5*$E63","v":5},null,null,{"$f":"5*$E63","v":5},{"$f":"5*$E63","v":5},{"$f":"5*$E63","v":5},{"$f":"5*$E63","v":5},null,{"$f":"5*$E63","v":5},null,{"$f":"5*$E63","v":5},null,null,null,{"$f":"5*$E63","v":5},{"$f":"5*$E63","v":5},null,{"$f":"5*$E63","v":5}]
["Romelu Lukaku - Everton",null,null,null,{"$f":"0+0+0+1","v":1},7,{"$f":"5*$E64","v":5},null,{"$f":"5*$E64","v":5},null,null,null,null,null,null,null,null,null,null,{"$f":"5*$E64","v":5},{"$f":"5*$E64","v":5},null,null,null,null,null,null,null,null,null,null,null,null,null,null,null,null,null,null,null,null,null,null,null,null,null,null,null,null,{"$f":"5*$E64","v":5},null,null,null,null,null,null,null,null,null,null,null,null,null,null,null,null,null,null,null,null,null,null,null,null,null,null,{"$f":"5*$E64","v":5},{"$f":"5*$E64","v":5}]
["Sergio Aguero - Man City",null,null,null,{"$f":"0+0+0+0","v":0},21,null,null,null,null,null,null,{"$f":"5*$E65","v":0},{"$f":"5*$E65","v":0},null,null,{"$f":"5*$E65","v":0},{"$f":"5*$E65","v":0},null,null,null,null,{"$f":"5*$E65","v":0},{"$f":"5*$E65","v":0},{"$f":"5*$E65","v":0},null,null,null,{"$f":"5*$E65","v":0},{"$f":"5*$E65","v":0},null,null,null,null,{"$f":"5*$E65","v":0},null,{"$f":"5*$E65","v":0},{"$f":"5*$E65","v":0},{"$f":"5*$E65","v":0},{"$f":"5*$E65","v":0},{"$f":"5*$E65","v":0},null,null,null,null,null,null,null,null,null,{"$f":"5*$E65","v":0},null,null,null,{"$f":"5*$E65","v":0},null,null,null,{"$f":"5*$E65","v":0},null,null,{"$f":"5*$E65","v":0},null,null,null,null,{"$f":"5*$E65","v":0},null,null,null,null,null,null,null,{"$f":"5*$E65","v":0}]
["Steven Gerrard - Liverpool",null,null,null,{"$f":"2+0+0+0","v":2},1,null,null,null,null,null,null,null,null,null,null,null,null,null,null,null,null,null,null,null,null,null,null,null,null,null,null,null,null,null,null,null,null,null,null,null,null,null,null,null,null,null,null,null,null,null,null,null,null,null,null,null,null,null,null,null,null,null,null,null,null,null,null,{"$f":"5*$E66","v":10}]
["Wayne Rooney - Man United",null,null,null,{"$f":"0+0+0+0","v":0},21,null,null,{"$f":"5*$E67","v":0},null,{"$f":"5*$E67","v":0},null,null,null,{"$f":"5*$E67","v":0},null,null,null,null,null,null,{"$f":"5*$E67","v":0},{"$f":"5*$E67","v":0},null,null,null,{"$f":"5*$E67","v":0},null,null,null,null,null,null,null,null,null,null,null,null,null,null,null,null,null,{"$f":"5*$E67","v":0},null,null,null,{"$f":"5*$E67","v":0},null,null,{"$f":"5*$E67","v":0},null,null,null,null,{"$f":"5*$E67","v":0},null,null,{"$f":"5*$E67","v":0},null,null,{"$f":"5*$E67","v":0},{"$f":"5*$E67","v":0},{"$f":"5*$E67","v":0},{"$f":"5*$E67","v":0},null,null,null,null,{"$f":"5*$E67","v":0},null,{"$f":"5*$E67","v":0},{"$f":"5*$E67","v":0},{"$f":"5*$E67","v":0},null,{"$f":"5*$E67","v":0},null,null,{"$f":"5*$E67","v":0}]
["Wilfried Bony - Swansea Man City",null,null,null,{"$f":"1+0+0+0","v":1},1,null,null,null,null,null,null,null,null,null,null,null,null,null,null,null,null,null,null,null,null,null,null,null,null,null,null,null,{"$f":"5*$E68","v":5}]
["Yaya Toure - Man City",null,null,null,{"$f":"1+0+0+0","v":1},3,null,null,null,null,null,null,null,null,null,null,null,null,null,null,null,null,null,null,null,null,null,null,null,null,{"$f":"5*$E69","v":5},null,null,null,null,null,null,null,null,null,null,null,null,null,null,null,null,null,null,null,null,null,null,null,null,null,null,null,null,null,null,null,null,null,null,null,null,null,null,{"$f":"5*$E69","v":5},null,{"$f":"5*$E69","v":5}]
[]
["Total Points - January",null,null,null,null,null,{"$f":"SUM(G2:G70)","v":100},140,110,150,90,145,115,120,135,130,90,120,115,140,120,115,120,110,145,140,100,110,105,120,155,120,130,145,105,130,135,115,{"$f":"SUM(AM2:AM70)","v":140},135,25,130,15,125,100,135,155,60,135,135,140,130,105,145,125,115,115,140,125,135,135,120,50,20,120,105,135,115,105,140,{"$f":"SUM(BS2:BS70)","v":5},155,105,95,105,110,115,70,90,120]
[]
[null,null,null,null,null,null,{"$f":"IF(COUNT(G54:G70)=3,\"a\",\"g\")","v":"a"},{"$f":"IF(COUNT(H54:H70)=3,\"a\",\"g\")","v":"a"},"a","a","a","a","a","a","a","a","a","a","a","a","a","a","a","a","a","a","a","a","a","a","a","a","a","a","a","a","a","a","a","a","a","a","a","a","a","a","a","a","a","a","a","a","a","a","a","a","a","a","a","a","a","a","a","a","a","a","a","a","a","a","a",{"$f":"IF(COUNT(BT54:BT70)=3,\"a\",\"g\")","v":"a"},"a","a","a","a","a","a","a","a"]

{"sheet":"February","index":7,"n_rows":75,"n_cols":80,"rows_kept":75,"cut":false,"hidden":false,"merged":[[42,0,42,4],[47,0,47,4],[1,0,1,4],[5,0,5,4],[14,0,14,4],[19,0,19,4],[25,0,25,4],[33,0,33,4]]}
[null,null,null,null,null,null,"Aaron Byrne","Aidan Knight","Aidan Scanlon","Aidan White","Aiden Desch","Alan Boyle","Anastas Popov","Andy Dunne","Anthony Hughes","Barry Healy","Brendan Maguire","Brian Mullen","Brian Prendergast","Brian Sotolongo","Chris Hall","Ciaran O'Hart","Cillian Conway","Colin McAnaspie","Con McSweeney","Conor Horan","Craig Calvert","Dave Green","Dave McGinley","David Bone","David Byrne","David Cooney","David Keavney","Eamon Fox","Fiachra Moynihan","Gareth Pierpoint","Gary McGurk","Gavin Morgan","Gerry Draper","Gerry Moore","Ian Healy","Javier Suarez Barreiro","Jenny Ellis","Joe Behan","Joe O'Hehir","Joe Turner","Jonathan Fox","Keith Horan","Kevin Donohoe","Kevin Philpott","Konstantin Kulev","Kris Stainton","Liam Butler","Liam Geraghty","Maria Jordan","Mike Hall","Niall Carroll","Oisin O'Reilly","Padraic Carney","Pat Jordan","Paul Moore","Paul Prendergast","Paul Stainton","Peter Behan","Phil Doyle","Philip Jordan","Ralph Goodwin","Ray Ellis","Rhona Devlin","Richard Johnston","Sean Moloney","Sean O'Mairtin","Shane Horan","Sharon Behan","Simon Purdue","Siobhan Murphy","Terry Behan","Tiago Moreira","Tom McHugh","Wayne Donovan"]
["Sunday, February 1st"]
["Arsenal",5,0,"Aston Villa","13:30:00",null,5,5,5,5,5,5,5,5,5,5,5,5,5,5,5,5,5,5,5,5,5,5,5,5,5,5,5,5,5,5,5,5,5,5,"-",5,"-",5,5,5,5,"-",5,5,"-",5,5,5,5,5,5,5,5,5,5,5,"-","-",5,5,5,5,0,5,"-",5,5,5,5,5,5,5,5,5]
["Southampton",0,1,"Swansea City","16:00:00",null,"-",0,0,0,0,0,0,0,0,0,0,0,0,0,0,0,0,0,0,0,0,0,0,0,0,0,0,0,0,0,0,0,0,0,"-",0,"-",0,0,0,0,"-",0,0,0,0,0,0,0,0,0,0,0,0,0,0,"-","-",0,0,0,0,0,0,"-",0,0,0,0,0,0,0,0,0]
[]
["Saturday, February 7th"]
["Tottenham",2,1,"Arsenal","12:45:00",null,"-",0,0,0,5,0,10,0,0,0,0,0,10,0,0,0,0,0,0,5,0,0,0,0,"-",0,0,0,0,0,10,0,0,0,"-",0,"-",0,0,10,0,"-",0,0,"-",0,10,0,0,0,0,0,0,0,0,0,"-","-",0,0,0,5,0,5,"-",0,5,0,0,0,0,0,0,10]
["Aston Villa",1,2,"Chelsea","15:00:00",null,"-",5,5,5,5,5,10,5,5,5,5,5,5,5,5,5,5,5,5,10,5,5,5,5,"-",5,5,5,5,5,5,5,5,5,"-",5,"-",5,5,5,5,"-",0,5,5,5,0,5,5,5,5,5,5,5,5,5,5,"-",5,5,5,10,0,5,"-",5,10,5,5,5,5,5,5,0]
["Leicester City",0,1,"Crystal Palace","15:00:00",null,"-",0,5,0,0,0,5,0,0,5,0,0,0,5,0,0,0,10,0,0,0,0,0,0,"-",0,5,10,0,0,5,10,0,0,"-",0,"-",5,0,0,0,"-",0,5,0,10,0,0,0,5,5,0,0,0,0,0,5,"-",5,0,0,0,0,5,"-",0,10,0,5,0,0,0,0,0]
["Man City",1,1,"Hull City","15:00:00",null,"-",0,0,0,0,0,0,0,0,0,0,0,0,0,0,0,0,0,0,0,0,0,0,0,"-",0,0,0,0,0,0,0,0,0,"-",0,"-",0,0,0,0,"-",10,0,0,0,0,0,0,0,0,0,0,0,0,0,0,"-",0,0,0,0,0,0,"-",0,0,0,0,0,0,0,0,0]
["QPR",0,1,"Southampton","15:00:00",null,"-",5,0,5,0,5,5,5,5,5,5,10,0,0,5,5,0,10,5,5,5,5,5,0,"-",0,5,5,0,5,5,10,0,5,"-",5,"-",5,5,0,5,"-",0,5,10,5,0,5,0,0,0,5,5,5,0,0,0,"-",5,0,10,0,0,0,"-",0,5,5,10,10,0,0,5,0]
["Swansea City",1,1,"Sunderland","15:00:00",null,"-",0,10,10,5,0,0,0,0,0,5,0,0,10,0,0,0,0,0,0,0,10,0,0,"-",0,0,0,10,0,0,0,0,10,"-",0,"-",0,0,0,0,"-",10,0,0,0,0,10,0,0,0,0,0,0,0,0,0,"-",0,0,0,10,10,0,"-",5,0,0,0,10,0,0,10,0]
["Everton",0,0,"Liverpool","17:30:00",null,"-",0,5,5,5,5,5,0,0,0,5,5,0,5,0,5,5,0,5,0,5,5,5,5,"-",5,5,0,5,0,0,0,5,5,"-",0,"-",5,5,10,0,"-",5,0,0,5,0,0,0,5,0,0,5,0,0,0,0,"-",0,5,5,0,0,0,"-",5,5,5,5,0,5,0,0,0]
[]
["Sunday, February 8th"]
["Burnley",2,2,"West Brom","12:00:00",null,"-",0,0,0,0,0,0,5,5,0,5,5,5,0,0,0,5,0,5,0,5,5,0,0,"-",0,5,0,0,0,0,0,0,5,"-",5,"-",5,0,0,0,"-",5,0,0,0,0,0,0,5,5,5,0,5,10,0,0,"-",10,0,0,0,5,0,"-",5,5,5,0,0,0,0,0,0]
["Newcastle United",1,1,"Stoke City","14:05:00",null,"-",0,0,0,0,0,0,0,10,10,0,0,0,0,0,0,0,0,0,0,0,0,10,0,"-",0,10,10,0,10,0,0,0,10,"-",0,"-",5,0,10,0,"-",10,10,0,0,0,0,0,10,0,0,5,0,0,0,0,"-",0,5,0,0,5,0,"-",10,0,0,0,0,10,10,0,0]
["West Ham",1,1,"Man United","16:15:00",null,"-",0,0,0,10,0,0,0,0,0,0,0,0,0,0,0,0,0,0,10,0,10,0,0,"-",0,0,0,0,5,5,10,0,10,"-",0,"-",0,0,0,0,"-",10,0,0,0,0,0,0,10,0,10,0,0,10,10,0,"-",0,0,10,0,0,0,"-",0,10,0,0,0,0,0,0,0]
[]
["Tuesday, February 10th"]
["Arsenal",2,1,"Leicester City","19:45:00",null,"-",5,5,5,5,5,5,5,5,5,5,5,10,5,5,5,5,5,5,5,5,5,5,5,"-",5,5,5,5,5,5,5,5,5,"-",5,"-",5,5,5,5,"-",5,5,"-",5,5,5,5,5,5,5,5,5,5,5,5,"-",5,5,5,10,10,5,"-",5,5,10,5,5,5,5,5,10]
["Hull City",2,0,"Aston Villa","19:45:00",null,"-",10,0,5,0,5,5,10,0,0,0,0,5,0,0,0,5,0,0,0,5,0,0,0,"-",0,0,5,0,0,5,5,0,0,"-",0,"-",0,5,5,5,"-",5,5,"-",0,0,10,10,0,5,5,5,0,0,0,0,"-",0,0,0,0,0,5,"-",0,0,5,5,5,0,5,0,5]
["Sunderland",0,2,"QPR","19:45:00",null,"-",0,0,0,0,0,0,0,0,0,0,0,0,0,0,0,0,0,0,0,0,0,0,0,"-",0,0,0,0,0,0,0,0,0,"-",0,"-",0,0,0,0,"-",0,0,"-",5,0,0,0,0,0,0,0,5,0,0,0,"-",0,0,0,0,5,0,"-",0,0,0,0,0,0,0,0,0]
["Liverpool",3,2,"Tottenham","20:00:00",null,"-",0,0,5,0,5,0,5,0,0,0,0,5,5,5,0,0,5,5,5,0,0,0,0,"-",5,0,5,0,5,5,5,0,0,"-",5,"-",0,0,0,5,"-",5,0,"-",0,5,5,5,5,0,0,0,0,5,5,0,"-",5,0,0,0,5,5,"-",5,10,5,0,0,5,5,0,5]
[]
["Wednesday, February 11th"]
["Chelsea",1,0,"Everton","19:45:00",null,"-",5,5,5,0,5,5,5,5,5,5,5,5,5,5,5,10,5,5,5,5,5,5,5,"-",5,5,5,5,5,5,5,5,5,"-",5,"-",5,5,5,5,"-",5,5,5,5,5,5,5,5,5,5,5,5,5,5,0,"-",5,5,5,5,0,5,"-",5,10,5,5,5,5,5,5,5]
["Man United",3,1,"Burnley","19:45:00",null,"-",5,10,5,5,5,5,10,5,5,5,5,5,5,5,5,5,5,5,5,5,5,5,5,"-",10,5,5,5,5,5,5,5,5,"-",5,"-",5,5,5,5,"-",5,10,5,5,5,5,5,5,10,5,10,10,5,5,5,"-",5,5,5,5,5,5,"-",5,5,5,10,5,5,5,10,5]
["Southampton",0,0,"West Ham","19:45:00",null,"-",0,0,5,0,0,0,5,0,0,5,0,0,0,0,5,5,5,0,0,5,5,0,0,"-",5,0,0,0,5,5,0,0,0,"-",0,"-",0,0,0,0,"-",0,0,0,0,5,0,5,5,0,5,0,0,5,10,0,"-",0,5,0,0,5,0,"-",5,5,0,0,0,0,0,0,0]
["Stoke City",1,4,"Man City","19:45:00",null,"-",5,0,5,5,5,0,5,0,5,0,5,0,5,5,0,5,5,5,5,5,5,5,5,"-",0,0,5,5,5,0,5,5,0,"-",5,"-",5,5,0,5,"-",5,5,5,5,5,0,5,5,5,5,0,5,0,5,0,"-",5,5,5,5,5,5,"-",5,5,0,5,5,0,5,5,0]
["Crystal Palace",1,1,"Newcastle","20:00:00",null,"-",10,0,0,10,0,0,5,0,0,10,0,0,10,0,10,0,0,0,10,0,10,0,10,"-",0,0,0,0,0,0,10,0,10,"-",10,"-",0,0,0,0,"-",0,0,0,0,0,0,10,0,0,0,0,0,0,10,0,"-",0,0,10,10,10,10,"-",0,10,0,0,0,0,0,0,0]
["West Brom",null,null,"Swansea City","20:00:00",null,"-",5,0,0,5,5,0,0,0,0,5,0,5,5,0,5,5,0,0,0,5,0,0,10,"-",5,0,0,5,5,0,5,0,0,"-",0,"-",5,5,10,5,"-",5,5,5,0,0,0,5,5,5,0,5,0,5,5,10,"-",0,0,5,0,0,0,"-",5,0,5,5,0,0,0,0,5]
[]
["Saturday, February 21st"]
["Aston Villa",1,2,"Stoke City","15:00:00",null,"-",0,0,0,0,0,0,0,0,0,0,0,0,0,0,0,0,0,0,0,0,0,0,0,"-",0,0,0,0,0,0,0,0,0,"-",0,"-",0,0,0,0,"-",0,0,5,0,0,0,0,0,0,10,0,0,0,0,"-","-",0,0,0,"-",0,5,"-",0,0,10,10,0,0,"-",0,0]
["Chelsea",1,1,"Burnley","15:00:00",null,"-",0,0,0,0,0,0,0,0,0,0,0,0,0,0,0,0,0,0,0,0,0,0,0,"-",0,0,0,0,0,0,0,0,0,"-",0,"-",0,0,0,0,"-",0,0,0,0,0,0,0,0,0,0,0,0,0,0,"-","-",0,0,0,"-",0,0,"-",0,0,0,0,0,0,"-",0,0]
["Crystal Palace",1,2,"Arsenal","15:00:00",null,"-",10,5,10,0,5,10,10,10,10,5,10,10,5,0,5,5,5,5,10,10,10,10,5,"-",10,10,5,10,10,0,10,10,5,"-",5,"-",0,10,0,10,"-",10,5,5,10,10,0,10,10,10,5,0,5,10,5,"-","-",5,5,5,"-",0,10,"-",10,5,10,5,5,5,"-",5,0]
["Hull City",2,1,"QPR","15:00:00",null,"-",5,0,0,5,10,10,0,5,10,5,0,0,10,5,5,5,5,10,0,0,0,0,0,"-",0,5,0,0,5,5,5,0,0,"-",0,"-",5,5,10,5,"-",10,0,5,0,10,10,0,0,5,10,10,10,0,0,"-","-",0,0,5,"-",10,0,"-",10,0,0,5,0,5,"-",10,5]
["Sunderland",0,0,"West Brom","15:00:00",null,"-",0,0,0,5,0,5,5,5,5,5,0,5,0,5,0,0,0,5,0,5,0,5,0,"-",5,0,5,5,0,0,0,5,10,"-",10,"-",10,0,5,0,"-",5,5,5,0,5,0,5,10,0,0,10,0,5,5,"-","-",0,0,0,"-",0,0,"-",10,0,5,0,0,10,"-",0,10]
["Swansea City",2,1,"Man United","15:00:00",null,"-",5,0,0,5,0,0,0,0,0,0,0,0,0,0,0,0,0,0,0,0,0,0,0,"-",0,0,0,0,0,0,0,0,0,"-",0,"-",5,0,10,0,"-",0,0,0,0,0,10,0,0,0,0,0,0,0,0,"-","-",0,0,0,"-",10,0,"-",0,0,0,0,0,0,"-",0,0]
["Man City",5,0,"Newcastle United","17:30:00",null,"-",5,5,5,5,5,5,5,5,5,5,5,5,5,5,5,5,5,5,5,5,5,5,5,"-",5,5,5,5,5,5,5,5,5,"-",5,"-",5,5,5,5,"-",5,5,5,5,5,5,5,5,5,5,5,5,5,5,"-","-",5,5,5,"-",5,5,"-",5,5,5,5,5,5,"-",5,5]
[]
["Sunday, February 22nd"]
["Tottenham",2,2,"West Ham","12:00:00",null,"-",5,0,0,0,0,0,0,0,0,0,0,0,0,0,5,0,0,0,0,0,10,0,0,"-",0,0,0,0,0,0,0,0,0,"-",0,"-",0,0,0,0,"-",5,0,0,0,5,0,5,0,0,0,0,0,0,0,"-","-",0,0,0,"-",0,0,"-",0,0,0,0,0,0,"-",0,0]
["Everton",2,2,"Leicester City","14:05:00",null,"-",0,0,0,0,0,0,0,0,0,0,0,0,0,0,0,0,0,0,0,0,5,0,0,"-",0,0,0,0,0,0,0,0,0,"-",0,"-",0,0,0,0,"-",0,0,0,0,0,0,0,0,0,0,0,0,0,0,"-","-",0,0,0,"-",0,0,"-",0,0,0,0,0,0,"-",0,0]
["Southampton",0,2,"Liverpool","16:15:00",null,"-",0,0,0,0,0,0,0,0,5,0,0,0,0,0,0,0,5,0,5,0,5,0,0,"-",0,0,0,0,5,5,0,0,0,"-",5,"-",0,0,0,0,"-",0,5,0,0,5,10,10,0,0,0,0,5,5,5,"-","-",0,0,0,"-",0,5,"-",0,0,0,0,0,10,"-",0,5]
[]
["Saturday, February 28th"]
["West Ham",1,3,"Crystal Palace","12:45:00",null,"-",0,0,0,0,0,0,0,0,0,0,0,0,0,0,0,0,0,0,0,0,0,0,0,"-",0,0,0,0,0,0,0,0,0,"-",0,"-",0,0,0,0,"-",0,0,"-",0,0,0,0,0,0,0,0,0,0,0,"-","-",0,0,0,"-",0,0,"-",0,0,0,0,0,0,0,"-",0]
["Burnley",0,1,"Swansea City","15:00:00",null,"-",0,5,0,0,0,0,0,0,0,0,10,0,0,0,0,0,5,0,5,0,0,0,0,"-",0,0,0,0,0,0,0,0,0,"-",0,"-",0,0,0,0,"-",0,0,0,10,0,5,0,0,0,5,0,5,0,5,"-","-",0,0,0,"-",0,0,"-",0,5,0,0,0,0,5,"-",0]
["Man United",2,0,"Sunderland","15:00:00",null,"-",10,5,10,5,5,5,5,5,10,5,5,10,10,5,10,10,5,10,5,10,5,10,0,"-",5,10,5,5,5,5,10,10,5,"-",5,"-",10,5,10,10,"-",5,10,10,5,10,0,10,5,5,5,10,5,10,10,"-","-",5,10,5,"-",5,5,"-",5,5,5,10,10,10,5,"-",0]
["Newcastle",1,0,"Aston Villa","15:00:00",null,"-",5,0,0,5,5,5,5,0,10,0,0,0,0,5,0,0,5,5,10,5,5,10,5,"-",0,5,5,0,5,0,10,5,5,"-",10,"-",5,10,10,10,"-",0,0,10,0,0,0,5,0,0,5,10,0,10,5,"-","-",5,0,10,"-",0,10,"-",5,5,5,5,0,5,0,"-",5]
["Stoke City",1,0,"Hull City","15:00:00",null,"-",10,0,10,5,5,10,0,5,5,5,0,5,5,5,10,0,0,5,10,5,0,5,10,"-",5,0,10,5,5,10,10,5,5,"-",10,"-",0,0,5,10,"-",0,10,5,0,5,0,10,0,0,5,5,0,10,10,"-","-",0,5,10,"-",5,10,"-",0,0,5,5,10,5,0,"-",5]
["West Brom",1,0,"Southampton","15:00:00",null,"-",5,0,0,0,0,0,0,0,0,0,0,0,5,0,5,0,0,0,0,0,0,0,0,"-",0,0,0,0,0,0,0,0,0,"-",10,"-",5,0,0,0,"-",0,10,0,0,0,0,0,0,5,0,0,0,0,0,"-","-",0,0,5,"-",0,10,"-",0,0,5,10,0,5,0,"-",0]
[]
["Golden Boots"]
["Alexis Sanchez - Arsenal",null,null,null,{"$f":"0+0+0+0","v":0},{"$f":"COUNT(G57:CB57)","v":14},null,{"$f":"5*$E57","v":0},null,null,null,null,null,{"$f":"5*$E57","v":0},null,null,null,null,null,{"$f":"5*$E57","v":0},null,null,null,null,{"$f":"5*$E57","v":0},{"$f":"5*$E57","v":0},null,null,{"$f":"5*$E57","v":0},null,null,null,null,null,null,null,null,null,null,null,null,null,{"$f":"5*$E57","v":0},null,{"$f":"5*$E57","v":0},null,null,null,null,null,null,{"$f":"5*$E57","v":0},null,null,null,null,null,{"$f":"5*$E57","v":0},null,null,null,null,{"$f":"5*$E57","v":0},{"$f":"5*$E57","v":0},null,null,null,null,null,null,null,null,null,{"$f":"5*$E57","v":0},null,null,null,{"$f":"5*$E57","v":0}]
["Daniel Sturridge - Liverpool",null,null,null,{"$f":"0+0+0","v":0},52,{"$f":"5*$E58","v":0},null,{"$f":"5*$E58","v":0},{"$f":"5*$E58","v":0},{"$f":"5*$E58","v":0},null,{"$f":"5*$E58","v":0},{"$f":"5*$E58","v":0},{"$f":"5*$E58","v":0},{"$f":"5*$E58","v":0},{"$f":"5*$E58","v":0},{"$f":"5*$E58","v":0},{"$f":"5*$E58","v":0},null,null,{"$f":"5*$E58","v":0},{"$f":"5*$E58","v":0},{"$f":"5*$E58","v":0},null,{"$f":"5*$E58","v":0},{"$f":"5*$E58","v":0},{"$f":"5*$E58","v":0},null,null,{"$f":"5*$E58","v":0},{"$f":"5*$E58","v":0},{"$f":"5*$E58","v":0},null,{"$f":"5*$E58","v":0},0,0,0,0,null,0,0,null,{"$f":"5*$E58","v":0},{"$f":"5*$E58","v":0},null,{"$f":"5*$E58","v":0},{"$f":"5*$E58","v":0},null,{"$f":"5*$E58","v":0},{"$f":"5*$E58","v":0},null,{"$f":"5*$E58","v":0},{"$f":"5*$E58","v":0},{"$f":"5*$E58","v":0},{"$f":"5*$E58","v":0},{"$f":"5*$E58","v":0},{"$f":"5*$E58","v":0},null,null,{"$f":"5*$E58","v":0},{"$f":"5*$E58","v":0},{"$f":"5*$E58","v":0},0,{"$f":"5*$E58","v":0},null,null,null,{"$f":"5*$E58","v":0},null,{"$f":"5*$E58","v":0},{"$f":"5*$E58","v":0},{"$f":"5*$E58","v":0},null,{"$f":"5*$E58","v":0},{"$f":"5*$E58","v":0},null,null,{"$f":"5*$E58","v":0},{"$f":"5*$E58","v":0}]
["Diego Costa - Chelsea",null,null,null,{"$f":"0+0+0","v":0},39,null,{"$f":"5*$E59","v":0},null,0,null,{"$f":"5*$E59","v":0},{"$f":"5*$E59","v":0},null,0,{"$f":"5*$E59","v":0},null,null,{"$f":"5*$E59","v":0},{"$f":"5*$E59","v":0},null,null,null,null,null,{"$f":"5*$E59","v":0},null,{"$f":"5*$E59","v":0},{"$f":"5*$E59","v":0},null,0,{"$f":"5*$E59","v":0},{"$f":"5*$E59","v":0},{"$f":"5*$E59","v":0},null,{"$f":"5*$E59","v":0},{"$f":"5*$E59","v":0},null,null,null,{"$f":"5*$E59","v":0},{"$f":"5*$E59","v":0},null,{"$f":"5*$E59","v":0},null,{"$f":"5*$E59","v":0},0,{"$f":"5*$E59","v":0},{"$f":"5*$E59","v":0},null,null,{"$f":"5*$E59","v":0},{"$f":"5*$E59","v":0},{"$f":"5*$E59","v":0},null,{"$f":"5*$E59","v":0},null,{"$f":"5*$E59","v":0},{"$f":"5*$E59","v":0},{"$f":"5*$E59","v":0},{"$f":"5*$E59","v":0},null,null,null,null,{"$f":"5*$E59","v":0},{"$f":"5*$E59","v":0},{"$f":"5*$E59","v":0},null,{"$f":"5*$E59","v":0},null,null,null,null,null,null,null,{"$f":"5*$E59","v":0},{"$f":"5*$E59","v":0},0]
["Eden Hazard - Chelsea",null,null,null,{"$f":"1+0+0","v":1},2,null,null,null,null,{"$f":"5*$E60","v":5},null,null,null,null,null,null,null,null,null,null,null,null,null,null,null,null,null,null,null,null,null,null,null,null,null,null,null,null,null,null,null,null,null,null,null,null,null,null,null,null,null,null,null,null,null,null,null,null,null,null,null,null,null,null,null,null,null,null,null,null,null,null,null,null,{"$f":"5*$E60","v":5}]
["Edin Dzeko - Man City",null,null,null,{"$f":"0+0+1","v":1},6,null,null,null,null,null,{"$f":"5*$E61","v":5},null,null,null,null,null,null,null,null,null,null,null,null,null,null,null,{"$f":"5*$E61","v":5},null,null,null,null,null,null,null,null,null,null,null,null,null,null,{"$f":"5*$E61","v":5},null,null,{"$f":"5*$E61","v":5},null,null,null,null,null,null,null,null,null,null,null,null,null,null,null,null,null,null,null,null,null,{"$f":"5*$E61","v":5},null,null,null,null,null,{"$f":"5*$E61","v":5}]
["Emmanuel Adebayor - Tottenham",null,null,null,{"$f":"0+0+0","v":0},3,null,null,null,null,null,null,null,null,null,null,null,null,null,null,{"$f":"5*$E62","v":0},null,null,null,null,null,null,null,null,null,null,null,null,null,null,null,null,null,null,{"$f":"5*$E62","v":0},null,null,null,null,null,null,null,null,null,null,null,null,null,null,null,null,null,null,null,null,null,null,null,null,null,null,null,null,null,null,{"$f":"5*$E62","v":0}]
["Olivier Giroud - Arsenal",null,null,null,{"$f":"1+0+0+1","v":2},4,null,null,null,null,null,{"$f":"5*$E63","v":10},null,null,null,null,null,null,null,null,null,null,null,null,null,null,null,null,null,{"$f":"5*$E63","v":10},null,null,null,null,null,null,null,null,null,10,null,null,null,null,null,null,null,{"$f":"5*$E63","v":10}]
["Raheem Sterling - Liverpool",null,null,null,{"$f":"0+0+1","v":1},3,null,null,null,null,null,null,null,null,null,null,null,null,null,null,null,null,null,null,null,null,null,null,null,null,null,null,null,null,null,null,null,null,null,null,null,null,null,null,null,{"$f":"5*$E64","v":5},null,null,null,null,null,null,null,null,null,null,null,null,null,null,null,null,null,null,null,null,null,null,{"$f":"5*$E64","v":5},null,null,null,{"$f":"5*$E64","v":5}]
["Robin van Persie - Man United",null,null,null,{"$f":"0+1+0+0","v":1},45,{"$f":"5*$E65","v":5},{"$f":"5*$E65","v":5},null,{"$f":"5*$E65","v":5},null,null,null,null,null,{"$f":"5*$E65","v":5},{"$f":"5*$E65","v":5},{"$f":"5*$E65","v":5},{"$f":"5*$E65","v":5},null,{"$f":"5*$E65","v":5},{"$f":"5*$E65","v":5},null,{"$f":"5*$E65","v":5},{"$f":"5*$E65","v":5},null,{"$f":"5*$E65","v":5},null,null,{"$f":"5*$E65","v":5},null,{"$f":"5*$E65","v":5},{"$f":"5*$E65","v":5},{"$f":"5*$E65","v":5},{"$f":"5*$E65","v":5},{"$f":"5*$E65","v":5},null,{"$f":"5*$E65","v":5},{"$f":"5*$E65","v":5},null,null,{"$f":"5*$E65","v":5},{"$f":"5*$E65","v":5},{"$f":"5*$E65","v":5},null,null,{"$f":"5*$E65","v":5},null,{"$f":"5*$E65","v":5},{"$f":"5*$E65","v":5},{"$f":"5*$E65","v":5},null,{"$f":"5*$E65","v":5},{"$f":"5*$E65","v":5},{"$f":"5*$E65","v":5},{"$f":"5*$E65","v":5},{"$f":"5*$E65","v":5},null,{"$f":"5*$E65","v":5},{"$f":"5*$E65","v":5},{"$f":"5*$E65","v":5},{"$f":"5*$E65","v":5},null,null,{"$f":"5*$E65","v":5},{"$f":"5*$E65","v":5},{"$f":"5*$E65","v":5},{"$f":"5*$E65","v":5},null,{"$f":"5*$E65","v":5},null,{"$f":"5*$E65","v":5},null,null,null,{"$f":"5*$E65","v":5},{"$f":"5*$E65","v":5},null,{"$f":"5*$E65","v":5}]
["Romelu Lukaku - Everton",null,null,null,{"$f":"0+0+0","v":0},7,{"$f":"5*$E66","v":0},null,{"$f":"5*$E66","v":0},null,null,null,null,null,null,null,null,null,null,{"$f":"5*$E66","v":0},{"$f":"5*$E66","v":0},null,null,null,null,null,null,null,null,null,null,null,null,null,null,null,null,null,null,null,null,null,null,null,null,null,null,null,null,{"$f":"5*$E66","v":0},null,null,null,null,null,null,null,null,null,null,null,null,null,null,null,null,null,null,null,null,null,null,null,null,null,null,{"$f":"5*$E66","v":0},{"$f":"5*$E66","v":0}]
["Sergio Aguero - Man City",null,null,null,{"$f":"0+2+1","v":3},21,null,null,null,null,null,null,{"$f":"5*$E67","v":15},{"$f":"5*$E67","v":15},null,null,{"$f":"5*$E67","v":15},{"$f":"5*$E67","v":15},null,null,null,null,{"$f":"5*$E67","v":15},{"$f":"5*$E67","v":15},{"$f":"5*$E67","v":15},null,null,null,{"$f":"5*$E67","v":15},{"$f":"5*$E67","v":15},null,null,null,null,{"$f":"5*$E67","v":15},null,{"$f":"5*$E67","v":15},{"$f":"5*$E67","v":15},{"$f":"5*$E67","v":15},{"$f":"5*$E67","v":15},{"$f":"5*$E67","v":15},null,null,null,null,null,null,null,null,null,{"$f":"5*$E67","v":15},null,null,null,{"$f":"5*$E67","v":15},null,null,null,{"$f":"5*$E67","v":15},null,null,{"$f":"5*$E67","v":15},null,null,null,null,{"$f":"5*$E67","v":15},null,null,null,null,null,null,null,{"$f":"5*$E67","v":15}]
["Steven Gerrard - Liverpool",null,null,null,{"$f":"0+1+0","v":1},1,null,null,null,null,null,null,null,null,null,null,null,null,null,null,null,null,null,null,null,null,null,null,null,null,null,null,null,null,null,null,null,null,null,null,null,null,null,null,null,null,null,null,null,null,null,null,null,null,null,null,null,null,null,null,null,null,null,null,null,null,null,null,{"$f":"5*$E68","v":5}]
["Wayne Rooney - Man United",null,null,null,{"$f":"0+0+0+2","v":2},21,null,null,{"$f":"5*$E69","v":10},null,{"$f":"5*$E69","v":10},null,null,null,{"$f":"5*$E69","v":10},null,null,null,null,null,null,{"$f":"5*$E69","v":10},{"$f":"5*$E69","v":10},null,null,null,{"$f":"5*$E69","v":10},null,null,null,null,null,null,null,null,null,null,null,null,null,null,null,null,null,{"$f":"5*$E69","v":10},null,null,null,{"$f":"5*$E69","v":10},null,null,{"$f":"5*$E69","v":10},null,null,null,null,{"$f":"5*$E69","v":10},null,null,{"$f":"5*$E69","v":10},null,null,{"$f":"5*$E69","v":10},{"$f":"5*$E69","v":10},{"$f":"5*$E69","v":10},{"$f":"5*$E69","v":10},null,null,null,null,{"$f":"5*$E69","v":10},null,{"$f":"5*$E69","v":10},{"$f":"5*$E69","v":10},{"$f":"5*$E69","v":10},null,{"$f":"5*$E69","v":10},null,null,{"$f":"5*$E69","v":10}]
["Wilfried Bony - Swansea Man City",null,null,null,{"$f":"0+0+0","v":0},1,null,null,null,null,null,null,null,null,null,null,null,null,null,null,null,null,null,null,null,null,null,null,null,null,null,null,null,{"$f":"5*$E70","v":0}]
["Yaya Toure - Man City",null,null,null,{"$f":"0+0+0","v":0},3,null,null,null,null,null,null,null,null,null,null,null,null,null,null,null,null,null,null,null,null,null,null,null,null,{"$f":"5*$E71","v":0},null,null,null,null,null,null,null,null,null,null,null,null,null,null,null,null,null,null,null,null,null,null,null,null,null,null,null,null,null,null,null,null,null,null,null,null,null,null,{"$f":"5*$E71","v":0},null,{"$f":"5*$E71","v":0}]
[]
["Total Points - February",null,null,null,null,null,{"$f":"SUM(G2:G72)","v":10},125,80,105,115,105,125,115,90,115,115,100,100,110,75,115,110,115,115,120,115,130,110,110,5,85,95,105,100,110,110,155,{"$f":"SUM(AM2:AM72)","v":95},140,15,120,10,110,95,135,105,10,145,120,105,95,105,100,145,115,100,110,125,100,120,140,40,10,90,85,135,75,110,125,{"$f":"SUM(BS2:BS72)","v":10},120,145,125,145,95,120,60,75,95]
[]
[null,null,null,null,null,null,{"$f":"IF(COUNT(G56:G72)=3,\"a\",\"g\")","v":"a"},{"$f":"IF(COUNT(H56:H72)=3,\"a\",\"g\")","v":"a"},"a","a","a","a","a","a","a","a","a","a","a","a","a","a","a","a","a","a","a","a","a","a","a","a","a","a","a","a","a","a","a","a","a","a","a","a","a","a","a","a","a","a","a","a","a","a","a","a","a","a","a","a","a","a","a","a","a","a","a","a","a","a","a",{"$f":"IF(COUNT(BT56:BT72)=3,\"a\",\"g\")","v":"a"},"a","a","a","a","a","a","a","a"]

{"sheet":"March","index":8,"n_rows":72,"n_cols":80,"rows_kept":72,"cut":false,"hidden":false,"merged":[[38,0,38,4],[47,0,47,4],[30,0,30,4],[35,0,35,4],[1,0,1,4],[5,0,5,4],[10,0,10,4],[19,0,19,4],[22,0,22,4]]}
[null,null,null,null,null,null,"Aaron Byrne","Aidan Knight","Aidan Scanlon","Aidan White","Aiden Desch","Alan Boyle","Anastas Popov","Andy Dunne","Anthony Hughes","Barry Healy","Brendan Maguire","Brian Mullen","Brian Prendergast","Brian Sotolongo","Chris Hall","Ciaran O'Hart","Cillian Conway","Colin McAnaspie","Con McSweeney","Conor Horan","Craig Calvert","Dave Green","Dave McGinley","David Bone","David Byrne","David Cooney","David Keavney","Eamon Fox","Fiachra Moynihan","Gareth Pierpoint","Gary McGurk","Gavin Morgan","Gerry Draper","Gerry Moore","Ian Healy","Javier Suarez Barreiro","Jenny Ellis","Joe Behan","Joe O'Hehir","Joe Turner","Jonathan Fox","Keith Horan","Kevin Donohoe","Kevin Philpott","Konstantin Kulev","Kris Stainton","Liam Butler","Liam Geraghty","Maria Jordan","Mike Hall","Niall Carroll","Oisin O'Reilly","Padraic Carney","Pat Jordan","Paul Moore","Paul Prendergast","Paul Stainton","Peter Behan","Phil Doyle","Philip Jordan","Ralph Goodwin","Ray Ellis","Rhona Devlin","Richard Johnston","Sean Moloney","Sean O'Mairtin","Shane Horan","Sharon Behan","Simon Purdue","Siobhan Murphy","Terry Behan","Tiago Moreira","Tom McHugh","Wayne Donovan"]
["Sunday, March 1st"]
["Liverpool",2,1,"Man City","12:00:00",null,"-",0,0,0,0,10,0,0,0,0,0,0,0,0,5,0,0,0,0,0,0,0,0,0,"-",0,10,0,0,0,5,10,0,0,"-",5,"-",0,5,0,0,"-",0,0,5,0,0,10,0,0,0,0,0,0,5,0,"-","-",0,0,0,"-",10,5,"-",5,0,10,0,0,5,0,"-",0]
["Arsenal",2,0,"Everton","14:05:00",null,"-",5,5,5,5,5,10,5,0,10,10,5,5,5,5,5,0,5,10,5,10,5,5,10,"-",0,5,5,10,5,5,5,10,5,"-",5,"-",0,10,10,5,"-",5,5,5,5,10,10,5,5,5,5,10,5,10,10,"-","-",5,5,5,"-",0,5,"-",10,5,5,5,5,10,5,"-",5]
[]
["Tuesday, March 3rd"]
["Aston Villa",2,1,"West Brom","19:45:00",null,"-",5,0,10,10,10,5,0,0,0,5,0,10,10,0,0,0,5,0,5,10,0,0,0,"-",5,0,0,0,0,0,5,0,0,"-",5,"-",0,5,0,5,"-",5,10,"-",5,0,0,5,0,0,0,0,10,5,5,"-","-",5,10,5,"-",10,5,"-",0,5,10,0,5,5,0,"-",10]
["Hull City",1,1,"Sunderland","19:45:00",null,"-",0,10,0,10,0,0,0,0,0,10,0,0,10,5,0,10,0,0,10,0,0,0,10,"-",0,0,0,0,0,0,0,0,0,"-",0,"-",0,0,0,0,"-",0,0,"-",0,0,0,10,0,0,0,0,0,0,10,"-","-",10,10,0,"-",0,10,"-",0,0,0,0,10,0,0,"-",0]
["Southampton",1,0,"Crystal Palace","19:45:00",null,"-",10,5,5,5,5,10,5,5,5,5,5,5,5,5,5,0,0,10,5,5,5,10,5,"-",5,0,0,10,5,5,5,5,0,"-",10,"-",5,5,5,10,"-",0,5,"-",5,0,5,5,0,5,5,5,5,5,5,"-","-",5,0,10,"-",0,5,"-",5,5,5,10,5,5,5,"-",5]
[]
["Wednesday, March 4th"]
["Man City",2,0,"Leicester City","19:45:00",null,"-",5,5,10,5,5,10,5,10,5,5,10,5,5,5,10,0,5,5,5,5,5,5,5,"-",5,10,10,10,5,5,10,10,5,"-",5,"-",10,5,5,10,"-",10,5,5,5,10,10,5,5,5,5,5,5,5,5,"-","-",10,5,5,"-",5,5,"-",5,10,5,5,5,10,10,"-",5]
["Newcastle United",0,1,"Man United","19:45:00",null,"-",0,0,5,0,0,0,0,5,5,5,5,5,0,5,0,0,0,5,0,5,0,5,5,"-",5,5,0,5,0,0,5,0,0,"-",0,"-",0,5,0,10,"-",5,5,0,5,5,0,5,5,5,5,0,5,0,0,"-","-",5,5,10,"-",5,5,"-",0,5,5,5,10,0,5,"-",0]
["QPR",1,2,"Arsenal","19:45:00",null,"-",5,0,5,5,10,10,5,5,5,5,10,0,5,0,5,0,5,5,10,5,5,10,5,"-",10,5,5,10,5,5,5,10,5,"-",0,"-",5,5,10,5,"-",5,10,5,10,0,5,5,10,0,5,5,5,0,5,"-","-",5,5,5,"-",0,10,"-",0,10,5,5,5,0,5,"-",10]
["Stoke City",2,0,"Everton","19:45:00",null,"-",0,0,0,0,0,10,0,0,0,0,0,10,5,5,5,0,5,0,0,0,0,0,0,"-",0,5,0,5,0,10,0,5,5,"-",5,"-",5,5,10,0,"-",5,0,10,0,10,10,0,5,0,5,5,0,0,0,"-","-",0,0,5,"-",0,0,"-",0,0,0,5,5,10,0,"-",5]
["Tottenham",3,2,"Swansea City","19:45:00",null,"-",5,5,5,5,5,5,5,5,5,5,5,5,5,5,5,0,5,5,5,5,5,5,5,"-",5,5,5,5,5,5,5,0,0,"-",5,"-",5,5,5,5,"-",5,5,5,0,5,5,0,5,5,5,5,5,0,5,"-","-",0,5,5,"-",0,5,"-",5,5,5,5,0,5,5,"-",5]
["West Ham United",0,1,"Chelsea","19:45:00",null,"-",10,5,5,0,5,5,5,5,5,0,5,5,5,5,5,0,5,0,5,5,5,5,0,"-",5,10,10,10,5,0,5,5,5,"-",0,"-",5,5,5,5,"-",5,5,10,5,5,5,0,5,0,5,5,5,0,5,"-","-",5,5,5,"-",10,5,"-",5,5,5,5,5,0,5,"-",0]
["Liverpool",2,0,"Burnley","20:00:00",null,"-",5,5,10,5,5,10,10,5,10,10,5,5,5,5,10,0,10,10,5,5,5,10,0,"-",5,10,10,10,5,5,5,5,5,"-",5,"-",5,10,10,10,"-",5,10,5,5,5,5,5,5,5,5,10,5,5,5,"-","-",5,5,10,"-",10,5,"-",10,5,5,10,0,10,5,"-",5]
[]
["Saturday, March 7th"]
["QPR",1,2,"Tottenham","15:00:00",null,"-",0,0,10,5,0,10,5,5,5,5,10,10,10,0,0,10,5,10,10,5,10,5,10,"-",0,0,10,10,10,0,10,0,0,"-",0,"-",5,10,0,10,"-",5,10,5,10,10,10,0,10,0,10,10,0,5,0,"-","-",0,10,5,"-",0,5,"-",0,10,5,10,5,0,5,"-",10]
[]
["Saturday, March 14th"]
["Crystal Palace",3,1,"QPR","12:45:00",null,"-",5,5,5,0,10,5,5,5,5,0,5,5,5,0,5,5,5,5,5,5,0,5,5,"-",5,5,5,5,10,0,5,5,5,"-",5,"-",5,5,5,5,"-",5,5,5,5,5,0,5,5,5,5,5,5,5,0,"-","-",5,5,10,5,0,5,"-",5,0,0,5,5,5,"-","-",5]
["Arsenal",3,0,"West Ham United","15:00:00",null,"-",5,5,5,0,5,5,5,5,5,10,5,10,5,10,5,5,5,5,5,5,5,5,5,"-",5,5,5,5,5,5,5,5,10,"-",5,"-",5,5,5,5,"-",5,5,5,5,5,5,5,5,10,10,5,5,5,5,"-","-",5,5,5,5,5,5,"-",10,5,5,10,5,5,"-","-",5]
["Leicester City",0,0,"Hull City","15:00:00",null,"-",0,5,5,5,5,5,10,0,5,0,0,5,0,0,5,5,0,0,10,5,5,5,0,"-",5,5,0,5,0,10,5,5,0,"-",0,"-",5,0,0,0,"-",5,0,0,0,0,0,0,5,5,5,0,5,0,0,"-","-",5,0,0,0,5,10,"-",0,0,5,5,5,0,"-","-",0]
["Sunderland",0,4,"Aston Villa","15:00:00",null,"-",0,0,0,5,0,0,0,5,0,0,0,5,0,0,0,0,0,0,5,0,0,0,0,"-",0,0,0,0,5,0,0,0,0,"-",0,"-",0,0,0,0,"-",5,0,0,5,0,5,5,0,0,0,0,5,0,0,"-","-",5,0,0,0,5,5,"-",0,5,0,0,5,0,"-","-",0]
["West Brom",1,0,"Stoke City","15:00:00",null,"-",10,0,10,5,0,0,0,0,5,5,5,5,5,0,10,10,10,5,0,5,0,5,5,"-",5,5,0,0,0,0,0,10,0,"-",10,"-",0,0,5,10,"-",5,10,0,10,5,0,0,0,10,0,5,0,0,10,"-","-",0,0,10,0,0,0,"-",0,0,0,10,10,5,"-","-",10]
["Burnley",1,0,"Man City","19:45:00",null,"-",0,0,0,0,0,0,0,0,0,0,5,0,0,0,0,0,0,0,0,0,0,0,0,"-",0,0,0,0,0,0,0,0,0,"-",0,"-",0,0,0,0,"-",0,0,0,0,0,0,0,0,0,0,0,0,0,0,"-","-",0,0,0,0,0,0,"-",0,0,0,0,0,0,"-","-",0]
[]
["Sunday, March 15th"]
["Chelsea",1,1,"Southampton","13:30:00",null,"-",0,5,0,10,0,0,10,0,0,0,0,0,0,0,0,0,0,10,0,0,0,0,0,"-",0,0,0,0,0,0,0,0,0,"-",0,"-",0,0,0,0,"-",0,0,0,0,0,0,0,0,0,0,0,0,0,0,"-","-",0,0,0,10,0,0,"-",0,0,0,0,0,0,"-","-",0]
["Everton",3,0,"Newcastle United","16:00:00",null,"-",5,0,0,5,5,5,5,5,0,5,5,5,5,5,5,5,0,5,0,5,0,5,0,"-",5,5,5,5,5,5,5,5,5,"-",0,"-",0,5,5,5,"-",0,5,0,0,5,5,5,5,0,0,5,5,0,5,"-","-",0,5,0,5,5,5,"-",5,10,5,0,0,5,"-","-",5]
["Man United",3,0,"Tottenham","16:00:00",null,"-",0,0,5,0,5,5,0,5,5,5,5,0,0,5,0,5,5,5,5,5,0,0,5,"-",0,5,5,0,0,0,5,0,0,"-",0,"-",0,0,0,0,"-",5,5,0,5,0,0,5,5,5,0,5,5,0,5,"-","-",5,0,5,0,5,0,"-",0,5,0,5,5,5,"-","-",0]
[]
["Monday, March 16th"]
["Swansea City",0,1,"Liverpool","20:00:00",null,"-",5,0,5,0,5,10,5,5,5,0,0,5,0,5,5,5,5,5,5,0,5,0,5,"-",5,5,5,5,5,10,5,0,5,"-",5,"-",0,5,0,5,"-",5,5,0,10,5,5,5,5,0,5,0,0,5,5,"-","-",0,0,10,5,5,5,"-",5,5,5,5,0,5,"-","-",5]
[]
["Saturday, March 21st"]
["Man City",3,0,"West Brom","12:45:00",null,"-",5,5,5,5,5,5,5,5,5,10,5,5,5,5,5,5,10,5,5,5,5,5,5,"-",5,5,5,5,5,0,10,5,0,"-",5,"-",5,5,5,5,"-",5,5,5,5,5,"-",10,5,"-",5,5,5,5,5,"-","-",5,10,10,5,5,5,"-",5,10,5,5,5,"-","-","-",5]
["Aston Villa",0,1,"Swansea City","15:00:00",null,"-",0,0,0,0,0,0,0,0,0,0,0,0,0,0,0,0,0,0,5,0,0,0,0,"-",0,0,0,0,0,0,0,0,0,"-",0,"-",0,0,0,0,"-",0,0,0,0,0,0,0,0,0,0,0,5,0,0,"-","-",0,0,0,0,0,0,"-",0,0,0,0,0,"-","-","-",0]
["Newcastle United",1,2,"Arsenal","15:00:00",null,"-",5,5,10,0,0,10,10,10,5,5,5,0,10,0,10,10,10,5,10,5,10,10,10,"-",5,10,5,10,5,0,10,10,10,"-",5,"-",5,10,0,5,"-",5,5,5,5,5,10,10,0,5,5,0,5,10,5,"-","-",5,5,5,0,0,5,"-",10,10,10,5,0,"-","-","-","-"]
["Southampton",2,0,"Burnley","15:00:00",null,"-",10,5,5,5,5,5,5,5,5,10,0,10,5,5,5,5,10,5,5,10,10,5,10,"-",5,10,10,10,10,10,5,10,5,"-",10,"-",10,10,10,5,"-",5,5,10,5,10,0,10,5,5,10,5,5,5,10,"-","-",5,0,5,5,0,5,"-",10,5,5,5,5,"-","-","-","-"]
["Stoke City",1,2,"Crystal Palace","15:00:00",null,"-",0,0,0,0,0,0,0,0,0,0,10,0,0,0,0,0,0,0,0,0,0,0,0,"-",0,0,0,0,0,0,0,0,0,"-",0,"-",0,0,0,0,"-",0,0,0,0,0,0,0,0,0,0,0,0,0,0,"-","-",10,0,0,0,0,0,"-",0,0,0,0,0,"-","-","-","-"]
["Tottenham",4,3,"Leicester City","15:00:00",null,"-",5,5,5,5,5,5,5,5,5,5,5,5,5,5,5,5,5,5,5,5,5,5,5,"-",5,5,5,5,5,5,5,5,0,"-",5,"-",5,5,5,5,"-",5,5,5,5,5,5,5,5,5,5,5,5,5,5,"-","-",5,5,5,5,0,5,"-",5,5,5,5,5,"-","-","-","-"]
["West Ham United",1,0,"Sunderland","17:30:00",null,"-",5,0,0,5,10,10,5,5,5,0,10,10,5,10,5,0,5,5,0,5,0,5,5,"-",0,10,10,0,5,5,5,5,5,"-",10,"-",0,5,5,10,"-",5,5,10,5,5,5,5,10,10,0,0,5,10,5,"-","-",5,10,5,0,5,0,"-",5,5,5,5,5,"-","-","-","-"]
[]
["Sunday, March 22nd"]
["Liverpool",1,2,"Man United","13:30:00",null,"-",0,0,0,0,0,0,0,0,0,5,0,0,0,0,0,10,0,0,0,5,0,0,0,"-",0,0,0,0,0,0,0,0,0,"-",0,"-",0,0,0,0,"-",0,0,0,10,0,0,10,0,0,10,0,5,0,0,"-","-",10,10,0,0,0,0,"-",0,0,0,0,0,"-","-","-",0]
["Hull City",2,3,"Chelsea","16:00:00",null,"-",5,5,5,5,0,5,5,5,5,5,5,5,5,5,5,5,5,5,5,5,5,5,5,"-",5,5,5,5,5,0,5,5,0,"-",5,"-",5,5,5,5,"-",5,5,5,5,5,5,5,0,5,5,5,5,5,5,"-","-",5,5,5,5,5,5,"-",5,5,5,5,0,"-","-","-",5]
["QPR",1,2,"Everton","16:00:00",null,"-",0,0,0,0,0,0,5,10,0,10,10,10,0,0,5,0,5,10,10,0,0,10,0,"-",0,0,0,0,0,0,0,0,0,"-",0,"-",0,10,0,5,"-",0,0,0,0,10,10,0,0,0,10,10,10,0,0,"-","-",0,0,0,0,5,10,"-",0,10,10,0,0,"-","-","-",10]
[]
["Golden Boots"]
["Alexis Sanchez - Arsenal",null,null,null,{"$f":"0+1+0+0","v":1},{"$f":"COUNT(G54:CB54)","v":14},null,{"$f":"5*$E54","v":5},null,null,null,null,null,{"$f":"5*$E54","v":5},null,null,null,null,null,{"$f":"5*$E54","v":5},null,null,null,null,{"$f":"5*$E54","v":5},{"$f":"5*$E54","v":5},null,null,{"$f":"5*$E54","v":5},null,null,null,null,null,null,null,null,null,null,null,null,null,{"$f":"5*$E54","v":5},null,{"$f":"5*$E54","v":5},null,null,null,null,null,null,{"$f":"5*$E54","v":5},null,null,null,null,null,{"$f":"5*$E54","v":5},null,null,null,null,{"$f":"5*$E54","v":5},{"$f":"5*$E54","v":5},null,null,null,null,null,null,null,null,null,{"$f":"5*$E54","v":5},null,null,null,{"$f":"5*$E54","v":5}]
["Daniel Sturridge - Liverpool",null,null,null,{"$f":"0+1+0+1","v":2},52,{"$f":"5*$E55","v":10},null,{"$f":"5*$E55","v":10},{"$f":"5*$E55","v":10},{"$f":"5*$E55","v":10},null,{"$f":"5*$E55","v":10},{"$f":"5*$E55","v":10},{"$f":"5*$E55","v":10},{"$f":"5*$E55","v":10},{"$f":"5*$E55","v":10},{"$f":"5*$E55","v":10},{"$f":"5*$E55","v":10},null,null,{"$f":"5*$E55","v":10},{"$f":"5*$E55","v":10},{"$f":"5*$E55","v":10},null,{"$f":"5*$E55","v":10},{"$f":"5*$E55","v":10},{"$f":"5*$E55","v":10},null,null,{"$f":"5*$E55","v":10},{"$f":"5*$E55","v":10},{"$f":"5*$E55","v":10},null,{"$f":"5*$E55","v":10},10,10,10,10,null,10,10,null,{"$f":"5*$E55","v":10},{"$f":"5*$E55","v":10},null,{"$f":"5*$E55","v":10},{"$f":"5*$E55","v":10},null,{"$f":"5*$E55","v":10},{"$f":"5*$E55","v":10},null,{"$f":"5*$E55","v":10},{"$f":"5*$E55","v":10},{"$f":"5*$E55","v":10},{"$f":"5*$E55","v":10},{"$f":"5*$E55","v":10},{"$f":"5*$E55","v":10},null,null,{"$f":"5*$E55","v":10},{"$f":"5*$E55","v":10},{"$f":"5*$E55","v":10},10,{"$f":"5*$E55","v":10},null,null,null,{"$f":"5*$E55","v":10},null,{"$f":"5*$E55","v":10},{"$f":"5*$E55","v":10},{"$f":"5*$E55","v":10},null,{"$f":"5*$E55","v":10},{"$f":"5*$E55","v":10},null,null,{"$f":"5*$E55","v":10},{"$f":"5*$E55","v":10}]
["Diego Costa - Chelsea",null,null,null,{"$f":"0+1+1","v":2},39,null,{"$f":"5*$E56","v":10},null,10,null,{"$f":"5*$E56","v":10},{"$f":"5*$E56","v":10},null,10,{"$f":"5*$E56","v":10},null,null,{"$f":"5*$E56","v":10},{"$f":"5*$E56","v":10},null,null,null,null,null,{"$f":"5*$E56","v":10},null,{"$f":"5*$E56","v":10},{"$f":"5*$E56","v":10},null,10,{"$f":"5*$E56","v":10},{"$f":"5*$E56","v":10},{"$f":"5*$E56","v":10},null,{"$f":"5*$E56","v":10},{"$f":"5*$E56","v":10},null,null,null,{"$f":"5*$E56","v":10},{"$f":"5*$E56","v":10},null,{"$f":"5*$E56","v":10},null,{"$f":"5*$E56","v":10},10,{"$f":"5*$E56","v":10},{"$f":"5*$E56","v":10},null,null,{"$f":"5*$E56","v":10},{"$f":"5*$E56","v":10},{"$f":"5*$E56","v":10},null,{"$f":"5*$E56","v":10},null,{"$f":"5*$E56","v":10},{"$f":"5*$E56","v":10},{"$f":"5*$E56","v":10},{"$f":"5*$E56","v":10},null,null,null,null,{"$f":"5*$E56","v":10},{"$f":"5*$E56","v":10},{"$f":"5*$E56","v":10},null,{"$f":"5*$E56","v":10},null,null,null,null,null,null,null,{"$f":"5*$E56","v":10},{"$f":"5*$E56","v":10},10]
["Eden Hazard - Chelsea",null,null,null,{"$f":"1+0+1","v":2},2,null,null,null,null,{"$f":"5*$E57","v":10},null,null,null,null,null,null,null,null,null,null,null,null,null,null,null,null,null,null,null,null,null,null,null,null,null,null,null,null,null,null,null,null,null,null,null,null,null,null,null,null,null,null,null,null,null,null,null,null,null,null,null,null,null,null,null,null,null,null,null,null,null,null,null,null,{"$f":"5*$E57","v":10}]
["Edin Dzeko - Man City",null,null,null,{"$f":"1+0+0+0","v":1},6,null,null,null,null,null,{"$f":"5*$E58","v":5},null,null,null,null,null,null,null,null,null,null,null,null,null,null,null,{"$f":"5*$E58","v":5},null,null,null,null,null,null,null,null,null,null,null,null,null,null,{"$f":"5*$E58","v":5},null,null,{"$f":"5*$E58","v":5},null,null,null,null,null,null,null,null,null,null,null,null,null,null,null,null,null,null,null,null,null,{"$f":"5*$E58","v":5},null,null,null,null,null,{"$f":"5*$E58","v":5}]
["Emmanuel Adebayor - Tottenham",null,null,null,{"$f":"0+0+0+0","v":0},3,null,null,null,null,null,null,null,null,null,null,null,null,null,null,{"$f":"5*$E59","v":0},null,null,null,null,null,null,null,null,null,null,null,null,null,null,null,null,null,null,{"$f":"5*$E59","v":0},null,null,null,null,null,null,null,null,null,null,null,null,null,null,null,null,null,null,null,null,null,null,null,null,null,null,null,null,null,null,{"$f":"5*$E59","v":0}]
["Olivier Giroud - Arsenal",null,null,null,{"$f":"1+1+1+2","v":5},4,null,null,null,null,null,{"$f":"5*$E60","v":25},null,null,null,null,null,null,null,null,null,null,null,null,null,null,null,null,null,{"$f":"5*$E60","v":25},null,null,null,null,null,null,null,null,null,25,null,null,null,null,null,null,null,{"$f":"5*$E60","v":25}]
["Raheem Sterling - Liverpool",null,null,null,{"$f":"0+0+0+0","v":0},3,null,null,null,null,null,null,null,null,null,null,null,null,null,null,null,null,null,null,null,null,null,null,null,null,null,null,null,null,null,null,null,null,null,null,null,null,null,null,null,{"$f":"5*$E61","v":0},null,null,null,null,null,null,null,null,null,null,null,null,null,null,null,null,null,null,null,null,null,null,{"$f":"5*$E61","v":0},null,null,null,{"$f":"5*$E61","v":0}]
["Robin van Persie - Man United",null,null,null,{"$f":"0+0+0","v":0},45,{"$f":"5*$E62","v":0},{"$f":"5*$E62","v":0},null,{"$f":"5*$E62","v":0},null,null,null,null,null,{"$f":"5*$E62","v":0},{"$f":"5*$E62","v":0},{"$f":"5*$E62","v":0},{"$f":"5*$E62","v":0},null,{"$f":"5*$E62","v":0},{"$f":"5*$E62","v":0},null,{"$f":"5*$E62","v":0},{"$f":"5*$E62","v":0},null,{"$f":"5*$E62","v":0},null,null,{"$f":"5*$E62","v":0},null,{"$f":"5*$E62","v":0},{"$f":"5*$E62","v":0},{"$f":"5*$E62","v":0},{"$f":"5*$E62","v":0},{"$f":"5*$E62","v":0},null,{"$f":"5*$E62","v":0},{"$f":"5*$E62","v":0},null,null,{"$f":"5*$E62","v":0},{"$f":"5*$E62","v":0},{"$f":"5*$E62","v":0},null,null,{"$f":"5*$E62","v":0},null,{"$f":"5*$E62","v":0},{"$f":"5*$E62","v":0},{"$f":"5*$E62","v":0},null,{"$f":"5*$E62","v":0},{"$f":"5*$E62","v":0},{"$f":"5*$E62","v":0},{"$f":"5*$E62","v":0},{"$f":"5*$E62","v":0},null,{"$f":"5*$E62","v":0},{"$f":"5*$E62","v":0},{"$f":"5*$E62","v":0},{"$f":"5*$E62","v":0},null,null,{"$f":"5*$E62","v":0},{"$f":"5*$E62","v":0},{"$f":"5*$E62","v":0},{"$f":"5*$E62","v":0},null,{"$f":"5*$E62","v":0},null,{"$f":"5*$E62","v":0},null,null,null,{"$f":"5*$E62","v":0},{"$f":"5*$E62","v":0},null,{"$f":"5*$E62","v":0}]
["Romelu Lukaku - Everton",null,null,null,{"$f":"0+1+0","v":1},7,{"$f":"5*$E63","v":5},null,{"$f":"5*$E63","v":5},null,null,null,null,null,null,null,null,null,null,{"$f":"5*$E63","v":5},{"$f":"5*$E63","v":5},null,null,null,null,null,null,null,null,null,null,null,null,null,null,null,null,null,null,null,null,null,null,null,null,null,null,null,null,{"$f":"5*$E63","v":5},null,null,null,null,null,null,null,null,null,null,null,null,null,null,null,null,null,null,null,null,null,null,null,null,null,null,{"$f":"5*$E63","v":5},{"$f":"5*$E63","v":5}]
["Sergio Aguero - Man City",null,null,null,{"$f":"0+0+0+0","v":0},21,null,null,null,null,null,null,{"$f":"5*$E64","v":0},{"$f":"5*$E64","v":0},null,null,{"$f":"5*$E64","v":0},{"$f":"5*$E64","v":0},null,null,null,null,{"$f":"5*$E64","v":0},{"$f":"5*$E64","v":0},{"$f":"5*$E64","v":0},null,null,null,{"$f":"5*$E64","v":0},{"$f":"5*$E64","v":0},null,null,null,null,{"$f":"5*$E64","v":0},null,{"$f":"5*$E64","v":0},{"$f":"5*$E64","v":0},{"$f":"5*$E64","v":0},{"$f":"5*$E64","v":0},{"$f":"5*$E64","v":0},null,null,null,null,null,null,null,null,null,{"$f":"5*$E64","v":0},null,null,null,{"$f":"5*$E64","v":0},null,null,null,{"$f":"5*$E64","v":0},null,null,{"$f":"5*$E64","v":0},null,null,null,null,{"$f":"5*$E64","v":0},null,null,null,null,null,null,null,{"$f":"5*$E64","v":0}]
["Steven Gerrard - Liverpool",null,null,null,{"$f":"0+0+0+0","v":0},1,null,null,null,null,null,null,null,null,null,null,null,null,null,null,null,null,null,null,null,null,null,null,null,null,null,null,null,null,null,null,null,null,null,null,null,null,null,null,null,null,null,null,null,null,null,null,null,null,null,null,null,null,null,null,null,null,null,null,null,null,null,null,{"$f":"5*$E65","v":0}]
["Wayne Rooney - Man United",null,null,null,{"$f":"0+1+0","v":1},21,null,null,{"$f":"5*$E66","v":5},null,{"$f":"5*$E66","v":5},null,null,null,{"$f":"5*$E66","v":5},null,null,null,null,null,null,{"$f":"5*$E66","v":5},{"$f":"5*$E66","v":5},null,null,null,{"$f":"5*$E66","v":5},null,null,null,null,null,null,null,null,null,null,null,null,null,null,null,null,null,{"$f":"5*$E66","v":5},null,null,null,{"$f":"5*$E66","v":5},null,null,{"$f":"5*$E66","v":5},null,null,null,null,{"$f":"5*$E66","v":5},null,null,{"$f":"5*$E66","v":5},null,null,{"$f":"5*$E66","v":5},{"$f":"5*$E66","v":5},{"$f":"5*$E66","v":5},{"$f":"5*$E66","v":5},null,null,null,null,{"$f":"5*$E66","v":5},null,{"$f":"5*$E66","v":5},{"$f":"5*$E66","v":5},{"$f":"5*$E66","v":5},null,{"$f":"5*$E66","v":5},null,null,{"$f":"5*$E66","v":5}]
["Wilfried Bony - Swansea Man City",null,null,null,{"$f":"0+0+0+1","v":1},1,null,null,null,null,null,null,null,null,null,null,null,null,null,null,null,null,null,null,null,null,null,null,null,null,null,null,null,{"$f":"5*$E67","v":5}]
["Yaya Toure - Man City",null,null,null,{"$f":"0+0+0+0","v":0},3,null,null,null,null,null,null,null,null,null,null,null,null,null,null,null,null,null,null,null,null,null,null,null,null,{"$f":"5*$E68","v":0},null,null,null,null,null,null,null,null,null,null,null,null,null,null,null,null,null,null,null,null,null,null,null,null,null,null,null,null,null,null,null,null,null,null,null,null,null,null,{"$f":"5*$E68","v":0},null,{"$f":"5*$E68","v":0}]
[]
["Total Points - March",null,null,null,null,null,{"$f":"SUM(G2:G69)","v":15},130,105,155,135,160,180,140,145,135,150,150,170,145,110,140,115,140,145,170,145,120,145,145,20,120,165,135,155,130,115,150,{"$f":"SUM(AM2:AM69)","v":130},100,20,130,10,110,165,125,165,45,135,150,115,155,150,150,140,130,110,155,125,145,115,130,20,20,145,140,155,65,110,150,{"$f":"SUM(BS2:BS69)","v":15},120,160,145,150,135,100,70,20,135]
[]
[null,null,null,null,null,null,{"$f":"IF(COUNT(G53:G69)=3,\"a\",\"g\")","v":"a"},{"$f":"IF(COUNT(H53:H69)=3,\"a\",\"g\")","v":"a"},"a","a","a","a","a","a","a","a","a","a","a","a","a","a","a","a","a","a","a","a","a","a","a","a","a","a","a","a","a","a","a","a","a","a","a","a","a","a","a","a","a","a","a","a","a","a","a","a","a","a","a","a","a","a","a","a","a","a","a","a","a","a","a",{"$f":"IF(COUNT(BT53:BT69)=3,\"a\",\"g\")","v":"a"},"a","a","a","a","a","a","a","a"]

{"sheet":"April","index":9,"n_rows":87,"n_cols":80,"rows_kept":87,"cut":false,"hidden":false,"merged":[[57,0,57,4],[64,0,64,4],[29,0,29,4],[33,0,33,4],[36,0,36,4],[43,0,43,4],[47,0,47,4],[61,0,61,4],[1,0,1,4],[10,0,10,4],[14,0,14,4],[17,0,17,4],[20,0,20,4]]}
[null,null,null,null,null,null,"Aaron Byrne","Aidan Knight","Aidan Scanlon","Aidan White","Aiden Desch","Alan Boyle","Anastas Popov","Andy Dunne","Anthony Hughes","Barry Healy","Brendan Maguire","Brian Mullen","Brian Prendergast","Brian Sotolongo","Chris Hall","Ciaran O'Hart","Cillian Conway","Colin McAnaspie","Con McSweeney","Conor Horan","Craig Calvert","Dave Green","Dave McGinley","David Bone","David Byrne","David Cooney","David Keavney","Eamon Fox","Fiachra Moynihan","Gareth Pierpoint","Gary McGurk","Gavin Morgan","Gerry Draper","Gerry Moore","Ian Healy","Javier Suarez Barreiro","Jenny Ellis","Joe Behan","Joe O'Hehir","Joe Turner","Jonathan Fox","Keith Horan","Kevin Donohoe","Kevin Philpott","Konstantin Kulev","Kris Stainton","Liam Butler","Liam Geraghty","Maria Jordan","Mike Hall","Niall Carroll","Oisin O'Reilly","Padraic Carney","Pat Jordan","Paul Moore","Paul Prendergast","Paul Stainton","Peter Behan","Phil Doyle","Philip Jordan","Ralph Goodwin","Ray Ellis","Rhona Devlin","Richard Johnston","Sean Moloney","Sean O'Mairtin","Shane Horan","Sharon Behan","Simon Purdue","Siobhan Murphy","Terry Behan","Tiago Moreira","Tom McHugh","Wayne Donovan"]
["Saturday, April 4th"]
["Arsenal",4,1,"Liverpool","12:45:00",null,"-",5,0,5,5,5,5,5,5,5,5,5,5,5,0,0,0,0,5,0,5,5,5,5,"-",0,5,5,5,0,0,5,5,5,"-",5,"-",0,5,5,5,"-",0,5,"-",0,5,0,5,0,5,5,5,5,0,0,"-","-",5,5,5,"-",0,5,"-",5,5,0,5,5,"-","-","-",5]
["Everton",1,0,"Southampton","15:00:00",null,"-",0,0,0,5,10,0,5,0,0,0,10,0,5,0,10,5,0,0,5,0,0,0,0,"-",5,0,0,0,10,5,0,5,0,"-","-","-",0,0,0,0,"-",5,5,0,0,0,5,10,5,0,5,0,0,0,5,"-","-",0,0,0,"-",5,10,"-",5,10,0,0,0,"-","-","-",5]
["Leicester City",2,1,"West Ham United","15:00:00",null,"-",5,0,0,5,5,0,5,0,10,5,0,5,0,5,0,0,0,10,0,0,0,0,0,"-",0,5,5,10,10,5,0,10,5,"-","-","-",0,0,10,5,"-",0,0,5,0,10,0,0,0,5,0,10,10,5,5,"-","-",5,0,0,"-",0,0,"-",5,5,5,0,0,"-","-","-",5]
["Man United",3,1,"Aston Villa","15:00:00",null,"-",5,5,5,5,5,5,5,10,5,5,5,5,5,5,5,5,5,5,5,5,5,5,5,"-",10,5,5,5,5,5,5,5,0,"-","-","-",5,5,5,5,"-",5,5,5,5,5,0,10,5,10,5,5,5,5,5,"-","-",5,5,5,"-",0,10,"-",10,5,5,5,5,"-","-","-",5]
["Swansea City",3,1,"Hull City","15:00:00",null,"-",5,0,5,5,5,5,5,5,5,5,5,5,5,0,5,5,5,5,5,5,5,5,5,"-",5,5,5,5,5,5,5,5,0,"-","-","-",5,5,5,5,"-",0,5,5,0,5,0,5,5,0,0,5,5,5,5,"-","-",0,0,5,"-",0,5,"-",0,5,5,5,5,"-","-","-",0]
["West Brom",1,4,"QPR","15:00:00",null,"-",0,0,0,0,0,0,0,0,0,0,0,0,0,5,0,0,0,0,0,0,0,0,0,"-",0,0,0,0,0,0,0,0,0,"-","-","-",0,0,0,0,"-",0,0,0,0,0,0,0,0,0,5,0,5,0,0,"-","-",0,5,0,"-",0,0,"-",0,0,0,0,0,"-","-","-",0]
["Chelsea",2,1,"Stoke City","17:30:00",null,"-",5,5,10,5,5,5,5,5,5,5,5,5,5,5,5,5,5,5,5,5,5,5,5,"-",5,5,5,5,5,5,5,5,0,"-","-","-",5,10,5,5,"-",5,5,5,5,5,5,10,5,10,5,5,5,5,5,"-","-",5,5,5,"-",0,5,"-",5,5,10,10,10,"-","-","-",5]
[]
["Sunday, April 5th"]
["Burnley",0,0,"Tottenham","13:30:00",null,"-",0,0,0,0,0,0,0,0,0,0,0,5,5,0,0,5,0,5,0,0,0,0,0,"-",0,5,0,0,0,0,0,0,5,"-","-","-",0,0,5,0,"-",0,0,"-",0,5,0,0,0,0,0,5,0,5,0,"-","-",0,0,0,"-",0,0,"-",5,0,0,0,0,"-","-","-",5]
["Sunderland",1,0,"Newcastle United","16:00:00",null,"-",10,5,0,0,10,0,5,0,0,0,0,5,0,5,0,5,0,0,0,0,0,5,0,"-",10,0,0,0,0,0,0,0,10,"-","-","-",0,5,5,5,"-",0,0,0,0,5,0,0,0,0,0,5,0,0,0,"-","-",0,5,0,"-",0,0,"-",0,10,0,0,5,"-","-","-",0]
[]
["Monday, April 6th"]
["Crystal Palace",2,1,"Man City","20:00:00",null,"-",0,0,0,0,"-",0,5,0,0,0,0,0,0,0,0,0,0,0,0,0,0,0,0,"-",0,0,0,0,0,0,0,0,0,"-","-","-",0,0,5,0,"-",0,0,0,0,5,5,0,0,0,0,0,0,0,0,"-","-",0,0,0,"-",0,0,"-",0,5,0,0,0,"-","-","-",0]
[]
["Tuesday, April 7th"]
["Aston Villa",3,3,"QPR","19:45:00",null,"-",0,0,0,0,"-",0,0,0,5,0,0,0,0,0,0,0,0,0,0,0,0,0,0,"-",0,0,0,0,0,0,0,0,5,"-","-","-",0,0,0,0,"-",0,0,0,0,0,0,5,5,0,5,0,5,0,0,"-","-",0,0,0,"-",0,5,"-",0,0,0,0,0,"-","-","-",0]
[]
["Saturday, April 11th"]
["Swansea City",1,1,"Everton","12:45:00",null,"-",0,10,10,10,"-",0,5,5,10,10,0,0,0,0,10,10,0,10,0,0,10,10,0,"-",5,0,10,0,10,0,0,0,10,"-","-","-",0,0,0,0,"-",10,0,"-",10,0,0,0,0,0,0,10,0,10,10,"-","-",10,10,0,"-",0,0,"-",0,0,10,10,10,"-","-","-",10]
["Southampton",2,0,"Hull City","15:00:00",null,"-",0,10,5,10,"-",10,5,10,5,10,5,10,10,5,5,5,10,10,5,10,0,5,10,"-",5,5,10,5,5,10,5,10,10,"-","-","-",10,5,10,5,"-",10,5,10,10,5,0,5,5,10,5,10,5,5,10,"-","-",10,5,10,"-",0,5,"-",10,10,5,5,5,"-","-","-",5]
["Sunderland",1,4,"Crystal Palace","15:00:00",null,"-",0,5,0,0,"-",0,0,5,0,0,5,0,0,0,0,0,5,0,5,0,0,0,0,"-",0,5,5,0,5,0,0,0,0,"-","-","-",0,0,0,0,"-",0,0,5,0,0,0,0,0,0,0,0,5,0,0,"-","-",5,0,0,"-",0,0,"-",0,5,5,5,0,"-","-","-",5]
["Tottenham",0,1,"Aston Villa","15:00:00",null,"-",0,0,0,0,"-",0,0,0,0,0,0,0,0,0,0,0,0,0,0,0,0,0,0,"-",0,0,0,0,0,0,0,0,0,"-","-","-",0,0,0,0,"-",0,0,0,0,0,0,0,0,0,0,0,0,0,0,"-","-",0,0,0,"-",5,0,"-",0,0,0,0,0,"-","-","-",0]
["West Brom",2,3,"Leicester City","15:00:00",null,"-",0,0,0,0,"-",0,0,0,0,0,0,0,0,0,0,0,0,0,0,0,0,0,0,"-",0,0,0,0,0,0,0,5,0,"-","-","-",0,0,0,0,"-",0,0,0,0,0,0,0,0,0,5,0,0,0,0,"-","-",0,0,0,"-",0,5,"-",0,5,0,0,0,"-","-","-",0]
["West Ham United",1,1,"Stoke City","15:00:00",null,"-",0,10,0,10,"-",0,10,10,0,0,10,10,10,0,0,10,10,0,10,10,5,10,5,"-",10,0,10,0,10,0,0,0,5,"-","-","-",10,0,0,0,"-",0,10,0,0,0,0,0,5,10,0,0,0,10,0,"-","-",0,0,10,"-",10,0,"-",10,0,0,10,0,"-","-","-",10]
["Burnley",0,1,"Arsenal","17:30:00",null,"-",5,5,5,5,"-",5,5,5,5,5,5,5,5,5,5,5,5,5,5,5,5,5,5,"-",5,5,5,5,5,0,5,5,5,"-","-","-",10,5,5,5,"-",5,5,5,5,0,5,5,0,5,5,5,5,5,5,"-","-",5,5,5,"-",5,5,"-",5,5,5,5,5,"-","-","-",5]
[]
["Sunday, April 12th"]
["QPR",0,1,"Chelsea","13:30:00",null,"-",5,5,5,5,"-",5,5,5,5,5,5,5,5,5,5,5,5,0,5,5,5,5,5,"-",5,0,5,5,5,0,5,5,0,"-","-","-",5,5,5,5,"-",5,5,5,5,0,5,5,5,0,5,0,5,5,5,"-","-",5,5,5,"-",5,5,"-",5,10,5,5,5,"-","-","-",5]
["Man United",4,2,"Man City","16:00:00",null,"-",0,5,5,0,"-",5,0,5,5,5,0,5,0,5,0,5,0,0,5,5,0,5,0,"-",0,5,0,5,0,5,5,0,0,"-","-","-",5,5,5,0,"-",0,5,5,5,5,0,5,0,5,0,0,5,0,0,"-","-",5,5,5,"-",5,0,"-",0,5,5,5,5,"-","-","-",0]
[]
["Monday, April 13th"]
["Liverpool",2,0,"Newcastle United","20:00:00",null,"-",5,5,10,10,"-",10,5,10,5,0,5,10,5,5,5,10,5,10,5,10,5,10,10,"-",5,5,10,5,5,10,5,10,5,"-","-","-",0,5,10,5,"-",10,10,5,5,5,10,0,5,5,5,10,5,10,10,"-","-",0,5,10,"-",10,5,"-",5,5,10,10,0,"-","-","-",5]
[]
["Saturday, April 18th"]
["Crystal Palace",0,2,"West Brom","15:00:00",null,"-",0,0,0,0,"-",0,0,0,0,0,0,0,0,5,0,0,0,0,0,0,0,0,0,"-",0,0,0,0,0,0,0,0,0,"-","-","-",0,0,0,0,"-",0,0,0,0,0,0,0,0,0,0,0,0,0,0,"-","-",0,0,0,"-",0,0,"-",0,0,0,0,0,"-","-","-",0]
["Everton",1,0,"Burnley","15:00:00",null,"-",5,5,10,5,"-",5,5,0,5,5,10,10,5,5,10,10,10,5,10,5,5,5,5,"-",5,10,5,5,5,5,5,5,0,"-","-","-",5,5,5,10,"-",5,10,5,0,5,5,5,10,5,5,5,5,10,5,"-","-",0,5,5,"-",5,10,"-",5,5,5,5,5,"-","-","-",0]
["Leicester City",2,0,"Swansea City","15:00:00",null,"-",5,0,0,5,"-",5,5,0,0,5,0,5,5,5,0,5,0,5,5,0,0,0,0,"-",5,5,5,5,0,5,0,5,5,"-","-","-",0,0,5,5,"-",5,0,5,5,0,0,10,5,5,10,5,0,0,0,"-","-",0,5,0,"-",0,5,"-",5,0,0,5,0,"-","-","-",5]
["Stoke City",2,1,"Southampton","15:00:00",null,"-",0,0,0,10,"-",0,0,0,0,0,0,0,0,0,5,0,0,0,0,0,0,0,0,"-",0,5,0,0,0,0,0,10,0,"-","-","-",0,0,10,0,"-",0,5,5,0,5,10,0,5,0,5,0,0,0,0,"-","-",0,0,0,"-",5,0,"-",0,0,0,0,0,"-","-","-",0]
["Chelsea",1,0,"Man United","17:30:00",null,"-",0,0,10,5,"-",10,5,0,10,0,0,5,0,0,0,10,10,0,0,0,0,0,5,"-",5,10,0,5,5,0,5,0,5,"-","-","-",0,0,10,10,"-",0,5,0,0,5,5,0,10,0,5,0,0,0,5,"-","-",0,0,5,"-",0,10,"-",0,5,0,5,0,"-","-","-",5]
[]
["Sunday, April 19th"]
["Man City",2,0,"West Ham","13:30:00",null,"-",5,5,5,5,"-",10,5,5,10,5,10,5,10,5,5,10,10,10,5,0,10,10,10,"-",5,5,5,10,5,10,5,10,10,"-","-","-",10,10,10,5,"-",10,10,5,5,10,0,5,5,10,10,5,5,10,5,"-","-",10,10,5,"-",0,5,"-",10,10,5,5,5,"-","-","-",5]
["Newcastle United",1,3,"Tottenham","16:00:00",null,"-",0,5,5,0,"-",5,0,5,5,0,0,0,10,10,5,5,5,0,5,5,5,5,0,"-",0,0,5,5,5,0,5,0,0,"-","-","-",5,5,5,5,"-",0,5,0,5,5,0,5,0,0,0,0,5,0,0,"-","-",5,5,5,"-",5,10,"-",0,0,5,5,5,"-","-","-",0]
[]
["Saturday, April 25th"]
["Southampton",2,2,"Tottenham","12:45:00",null,"-",5,0,5,10,"-",0,5,0,5,0,0,5,0,0,5,5,5,0,5,5,10,5,0,"-",0,5,0,5,0,5,0,0,0,"-",10,"-",5,0,0,0,"-",0,0,"-",5,0,0,0,5,5,0,0,0,5,0,"-","-",10,5,0,"-",0,10,"-",0,0,0,5,0,"-",0,"-","-"]
["Burnley",0,1,"Leicester City","15:00:00",null,"-",5,5,0,5,"-",0,0,0,0,0,0,0,0,0,0,5,0,0,0,0,0,0,0,"-",0,5,0,0,0,0,0,5,0,"-",10,"-",0,5,0,0,"-",0,0,"-",0,0,0,0,0,5,0,0,5,0,0,"-","-",0,5,0,"-",0,0,"-",0,0,10,0,0,"-",0,"-",0]
["Crystal Palace",0,2,"Hull City","15:00:00",null,"-",0,0,0,0,"-",0,0,0,0,0,0,0,0,0,0,0,0,0,5,0,0,0,0,"-",0,0,0,0,0,0,0,5,0,"-",0,"-",0,0,0,0,"-",0,0,"-",0,0,5,0,0,0,0,0,0,0,0,"-","-",0,0,0,"-",0,0,"-",0,0,0,0,0,"-",0,"-",0]
["Newcastle United",2,3,"Swansea City","15:00:00",null,"-",0,5,0,0,"-",0,0,0,5,5,0,0,0,0,0,0,0,0,0,0,5,0,0,"-",0,5,5,0,0,0,0,0,5,"-",0,"-",0,5,0,5,"-",0,0,"-",5,0,0,0,0,0,0,0,5,0,0,"-","-",5,0,0,"-",0,5,"-",0,0,0,0,5,"-",0,"-",5]
["QPR",0,0,"West Ham","15:00:00",null,"-",0,0,0,0,"-",0,0,0,5,0,0,0,0,0,0,0,0,0,0,0,5,0,5,"-",0,0,5,0,0,5,5,0,10,"-",0,"-",0,5,0,0,"-",5,0,"-",0,0,0,0,0,0,0,0,0,5,0,"-","-",5,5,5,"-",0,0,"-",0,10,0,0,0,"-",0,"-",0]
["Stoke City",1,1,"Sunderland","15:00:00",null,"-",10,0,0,0,"-",0,0,10,0,0,0,0,0,10,0,0,0,0,0,0,0,0,10,"-",0,0,0,10,0,0,0,0,0,"-",5,"-",0,0,0,0,"-",0,0,"-",0,0,0,0,0,0,10,0,0,0,0,"-","-",0,0,0,"-",0,0,"-",0,0,0,0,0,"-",0,"-",0]
["West Brom",0,0,"Liverpool","15:00:00",null,"-",5,0,0,0,"-",0,0,0,5,5,0,5,0,0,0,0,0,5,0,0,0,5,0,"-",5,0,0,5,0,0,0,0,5,"-",0,"-",5,5,0,0,"-",0,0,"-",10,0,0,0,0,0,0,10,0,0,0,"-","-",5,0,0,"-",0,0,"-",0,0,0,0,0,"-",0,"-",5]
["Man City",3,2,"Aston Villa","17:30:00",null,"-",5,5,5,5,"-",5,5,5,5,5,5,5,5,5,5,5,5,5,5,5,5,5,5,"-",5,5,5,5,5,5,5,5,5,"-",5,"-",5,5,5,5,"-",5,5,"-",5,5,0,5,5,5,5,5,5,5,5,"-","-",10,5,5,"-",5,5,"-",5,5,5,5,5,"-",5,"-",5]
[]
["Sunday, April 26th"]
["Everton",3,0,"Man United","13:30:00",null,"-",0,0,0,0,"-",0,0,0,0,0,0,0,5,0,0,0,0,0,0,0,0,0,0,"-",0,0,0,0,0,0,0,5,0,"-",0,"-",0,0,5,0,"-",0,0,"-",0,5,5,0,0,0,0,0,0,0,5,"-","-",0,0,0,"-",5,0,"-",0,0,0,0,0,"-",0,"-",0]
["Arsenal",0,0,"Chelsea","16:00:00",null,"-",0,5,5,0,"-",5,5,5,0,10,0,10,0,0,5,10,0,0,0,5,0,5,5,"-",0,0,5,5,5,10,5,0,0,"-",0,"-",10,0,10,0,"-",5,0,"-",5,10,5,0,10,5,0,0,0,5,0,"-","-",0,0,5,"-",0,0,"-",5,0,0,5,0,"-",0,"-",5]
[]
["Wednesday, April 28th"]
["Hull City",1,0,"Liverpool","19:45:00",null,"-",0,0,0,0,"-",5,0,0,0,0,0,5,0,0,0,0,0,0,0,0,0,0,0,"-",10,0,0,0,0,0,0,5,0,"-",0,"-",5,10,5,0,"-",0,0,10,10,5,0,0,0,5,0,5,0,0,5,"-","-",0,0,0,"-","-",0,"-",0,0,0,0,10,"-",0,"-","-"]
[]
["Wednesday, April 29th"]
["Leicester City",1,3,"Chelsea","19:45:00",null,"-",10,5,5,5,"-",5,10,5,5,5,5,0,0,10,0,5,5,5,5,5,10,10,5,"-",5,5,5,5,10,5,5,0,0,"-",5,"-",0,0,5,5,"-",5,5,5,5,5,5,5,5,5,5,0,5,5,0,"-","-",5,5,5,"-","-",5,"-",0,5,5,5,10,"-",5,"-","-"]
[]
["Golden Boots"]
["Alexis Sanchez - Arsenal",null,null,null,{"$f":"1+0+0","v":1},{"$f":"COUNT(G69:CB69)","v":14},null,{"$f":"5*$E69","v":5},null,null,null,null,null,{"$f":"5*$E69","v":5},null,null,null,null,null,{"$f":"5*$E69","v":5},null,null,null,null,{"$f":"5*$E69","v":5},{"$f":"5*$E69","v":5},null,null,{"$f":"5*$E69","v":5},null,null,null,null,null,null,null,null,null,null,null,null,null,{"$f":"5*$E69","v":5},null,{"$f":"5*$E69","v":5},null,null,null,null,null,null,{"$f":"5*$E69","v":5},null,null,null,null,null,{"$f":"5*$E69","v":5},null,null,null,null,{"$f":"5*$E69","v":5},{"$f":"5*$E69","v":5},null,null,null,null,null,null,null,null,null,{"$f":"5*$E69","v":5},null,null,null,{"$f":"5*$E69","v":5}]
["Daniel Sturridge - Liverpool",null,null,null,{"$f":"0+0+0+0","v":0},52,{"$f":"5*$E70","v":0},null,{"$f":"5*$E70","v":0},{"$f":"5*$E70","v":0},{"$f":"5*$E70","v":0},null,{"$f":"5*$E70","v":0},{"$f":"5*$E70","v":0},{"$f":"5*$E70","v":0},{"$f":"5*$E70","v":0},{"$f":"5*$E70","v":0},{"$f":"5*$E70","v":0},{"$f":"5*$E70","v":0},null,null,{"$f":"5*$E70","v":0},{"$f":"5*$E70","v":0},{"$f":"5*$E70","v":0},null,{"$f":"5*$E70","v":0},{"$f":"5*$E70","v":0},{"$f":"5*$E70","v":0},null,null,{"$f":"5*$E70","v":0},{"$f":"5*$E70","v":0},{"$f":"5*$E70","v":0},null,{"$f":"5*$E70","v":0},0,0,0,0,null,0,0,null,{"$f":"5*$E70","v":0},{"$f":"5*$E70","v":0},null,{"$f":"5*$E70","v":0},{"$f":"5*$E70","v":0},null,{"$f":"5*$E70","v":0},{"$f":"5*$E70","v":0},null,{"$f":"5*$E70","v":0},{"$f":"5*$E70","v":0},{"$f":"5*$E70","v":0},{"$f":"5*$E70","v":0},{"$f":"5*$E70","v":0},{"$f":"5*$E70","v":0},null,null,{"$f":"5*$E70","v":0},{"$f":"5*$E70","v":0},{"$f":"5*$E70","v":0},0,{"$f":"5*$E70","v":0},null,null,null,{"$f":"5*$E70","v":0},null,{"$f":"5*$E70","v":0},{"$f":"5*$E70","v":0},{"$f":"5*$E70","v":0},null,{"$f":"5*$E70","v":0},{"$f":"5*$E70","v":0},null,null,{"$f":"5*$E70","v":0},{"$f":"5*$E70","v":0}]
["Diego Costa - Chelsea",null,null,null,{"$f":"0+0+0+0+0","v":0},39,null,{"$f":"5*$E71","v":0},null,0,null,{"$f":"5*$E71","v":0},{"$f":"5*$E71","v":0},null,0,{"$f":"5*$E71","v":0},null,null,{"$f":"5*$E71","v":0},{"$f":"5*$E71","v":0},null,null,null,null,null,{"$f":"5*$E71","v":0},null,{"$f":"5*$E71","v":0},{"$f":"5*$E71","v":0},null,0,{"$f":"5*$E71","v":0},{"$f":"5*$E71","v":0},{"$f":"5*$E71","v":0},null,{"$f":"5*$E71","v":0},{"$f":"5*$E71","v":0},null,null,null,{"$f":"5*$E71","v":0},{"$f":"5*$E71","v":0},null,{"$f":"5*$E71","v":0},null,{"$f":"5*$E71","v":0},0,{"$f":"5*$E71","v":0},{"$f":"5*$E71","v":0},null,null,{"$f":"5*$E71","v":0},{"$f":"5*$E71","v":0},{"$f":"5*$E71","v":0},null,{"$f":"5*$E71","v":0},null,{"$f":"5*$E71","v":0},{"$f":"5*$E71","v":0},{"$f":"5*$E71","v":0},{"$f":"5*$E71","v":0},null,null,null,null,{"$f":"5*$E71","v":0},{"$f":"5*$E71","v":0},{"$f":"5*$E71","v":0},null,{"$f":"5*$E71","v":0},null,null,null,null,null,null,null,{"$f":"5*$E71","v":0},{"$f":"5*$E71","v":0},0]
["Eden Hazard - Chelsea",null,null,null,{"$f":"1+0+2+0+0","v":3},2,null,null,null,null,{"$f":"5*$E72","v":15},null,null,null,null,null,null,null,null,null,null,null,null,null,null,null,null,null,null,null,null,null,null,null,null,null,null,null,null,null,null,null,null,null,null,null,null,null,null,null,null,null,null,null,null,null,null,null,null,null,null,null,null,null,null,null,null,null,null,null,null,null,null,null,null,{"$f":"5*$E72","v":15}]
["Edin Dzeko - Man City",null,null,null,{"$f":"0+0+0+0","v":0},6,null,null,null,null,null,{"$f":"5*$E73","v":0},null,null,null,null,null,null,null,null,null,null,null,null,null,null,null,{"$f":"5*$E73","v":0},null,null,null,null,null,null,null,null,null,null,null,null,null,null,{"$f":"5*$E73","v":0},null,null,{"$f":"5*$E73","v":0},null,null,null,null,null,null,null,null,null,null,null,null,null,null,null,null,null,null,null,null,null,{"$f":"5*$E73","v":0},null,null,null,null,null,{"$f":"5*$E73","v":0}]
["Emmanuel Adebayor - Tottenham",null,null,null,{"$f":"0+0+0+0","v":0},3,null,null,null,null,null,null,null,null,null,null,null,null,null,null,{"$f":"5*$E74","v":0},null,null,null,null,null,null,null,null,null,null,null,null,null,null,null,null,null,null,{"$f":"5*$E74","v":0},null,null,null,null,null,null,null,null,null,null,null,null,null,null,null,null,null,null,null,null,null,null,null,null,null,null,null,null,null,null,{"$f":"5*$E74","v":0}]
["Olivier Giroud - Arsenal",null,null,null,{"$f":"1+0+0","v":1},4,null,null,null,null,null,{"$f":"5*$E75","v":5},null,null,null,null,null,null,null,null,null,null,null,null,null,null,null,null,null,{"$f":"5*$E75","v":5},null,null,null,null,null,null,null,null,null,5,null,null,null,null,null,null,null,{"$f":"5*$E75","v":5}]
["Raheem Sterling - Liverpool",null,null,null,{"$f":"0+1+0+0","v":1},3,null,null,null,null,null,null,null,null,null,null,null,null,null,null,null,null,null,null,null,null,null,null,null,null,null,null,null,null,null,null,null,null,null,null,null,null,null,null,null,{"$f":"5*$E76","v":5},null,null,null,null,null,null,null,null,null,null,null,null,null,null,null,null,null,null,null,null,null,null,{"$f":"5*$E76","v":5},null,null,null,{"$f":"5*$E76","v":5}]
["Robin van Persie - Man United",null,null,null,{"$f":"0+0+0+0","v":0},45,{"$f":"5*$E77","v":0},{"$f":"5*$E77","v":0},null,{"$f":"5*$E77","v":0},null,null,null,null,null,{"$f":"5*$E77","v":0},{"$f":"5*$E77","v":0},{"$f":"5*$E77","v":0},{"$f":"5*$E77","v":0},null,{"$f":"5*$E77","v":0},{"$f":"5*$E77","v":0},null,{"$f":"5*$E77","v":0},{"$f":"5*$E77","v":0},null,{"$f":"5*$E77","v":0},null,null,{"$f":"5*$E77","v":0},null,{"$f":"5*$E77","v":0},{"$f":"5*$E77","v":0},{"$f":"5*$E77","v":0},{"$f":"5*$E77","v":0},{"$f":"5*$E77","v":0},null,{"$f":"5*$E77","v":0},{"$f":"5*$E77","v":0},null,null,{"$f":"5*$E77","v":0},{"$f":"5*$E77","v":0},{"$f":"5*$E77","v":0},null,null,{"$f":"5*$E77","v":0},null,{"$f":"5*$E77","v":0},{"$f":"5*$E77","v":0},{"$f":"5*$E77","v":0},null,{"$f":"5*$E77","v":0},{"$f":"5*$E77","v":0},{"$f":"5*$E77","v":0},{"$f":"5*$E77","v":0},{"$f":"5*$E77","v":0},null,{"$f":"5*$E77","v":0},{"$f":"5*$E77","v":0},{"$f":"5*$E77","v":0},{"$f":"5*$E77","v":0},null,null,{"$f":"5*$E77","v":0},{"$f":"5*$E77","v":0},{"$f":"5*$E77","v":0},{"$f":"5*$E77","v":0},null,{"$f":"5*$E77","v":0},null,{"$f":"5*$E77","v":0},null,null,null,{"$f":"5*$E77","v":0},{"$f":"5*$E77","v":0},null,{"$f":"5*$E77","v":0}]
["Romelu Lukaku - Everton",null,null,null,{"$f":"0+0+0+0","v":0},7,{"$f":"5*$E78","v":0},null,{"$f":"5*$E78","v":0},null,null,null,null,null,null,null,null,null,null,{"$f":"5*$E78","v":0},{"$f":"5*$E78","v":0},null,null,null,null,null,null,null,null,null,null,null,null,null,null,null,null,null,null,null,null,null,null,null,null,null,null,null,null,{"$f":"5*$E78","v":0},null,null,null,null,null,null,null,null,null,null,null,null,null,null,null,null,null,null,null,null,null,null,null,null,null,null,{"$f":"5*$E78","v":0},{"$f":"5*$E78","v":0}]
["Sergio Aguero - Man City",null,null,null,{"$f":"0+2+1+1","v":4},21,null,null,null,null,null,null,{"$f":"5*$E79","v":20},{"$f":"5*$E79","v":20},null,null,{"$f":"5*$E79","v":20},{"$f":"5*$E79","v":20},null,null,null,null,{"$f":"5*$E79","v":20},{"$f":"5*$E79","v":20},{"$f":"5*$E79","v":20},null,null,null,{"$f":"5*$E79","v":20},{"$f":"5*$E79","v":20},null,null,null,null,{"$f":"5*$E79","v":20},null,{"$f":"5*$E79","v":20},{"$f":"5*$E79","v":20},{"$f":"5*$E79","v":20},{"$f":"5*$E79","v":20},{"$f":"5*$E79","v":20},null,null,null,null,null,null,null,null,null,{"$f":"5*$E79","v":20},null,null,null,{"$f":"5*$E79","v":20},null,null,null,{"$f":"5*$E79","v":20},null,null,{"$f":"5*$E79","v":20},null,null,null,null,{"$f":"5*$E79","v":20},null,null,null,null,null,null,null,{"$f":"5*$E79","v":20}]
["Steven Gerrard - Liverpool",null,null,null,{"$f":"0+0+0+0","v":0},1,null,null,null,null,null,null,null,null,null,null,null,null,null,null,null,null,null,null,null,null,null,null,null,null,null,null,null,null,null,null,null,null,null,null,null,null,null,null,null,null,null,null,null,null,null,null,null,null,null,null,null,null,null,null,null,null,null,null,null,null,null,null,{"$f":"5*$E80","v":0}]
["Wayne Rooney - Man United",null,null,null,{"$f":"1+0+0+0","v":1},21,null,null,{"$f":"5*$E81","v":5},null,{"$f":"5*$E81","v":5},null,null,null,{"$f":"5*$E81","v":5},null,null,null,null,null,null,{"$f":"5*$E81","v":5},{"$f":"5*$E81","v":5},null,null,null,{"$f":"5*$E81","v":5},null,null,null,null,null,null,null,null,null,null,null,null,null,null,null,null,null,{"$f":"5*$E81","v":5},null,null,null,{"$f":"5*$E81","v":5},null,null,{"$f":"5*$E81","v":5},null,null,null,null,{"$f":"5*$E81","v":5},null,null,{"$f":"5*$E81","v":5},null,null,{"$f":"5*$E81","v":5},{"$f":"5*$E81","v":5},{"$f":"5*$E81","v":5},{"$f":"5*$E81","v":5},null,null,null,null,{"$f":"5*$E81","v":5},null,{"$f":"5*$E81","v":5},{"$f":"5*$E81","v":5},{"$f":"5*$E81","v":5},null,{"$f":"5*$E81","v":5},null,null,{"$f":"5*$E81","v":5}]
["Wilfried Bony - Swansea Man City",null,null,null,{"$f":"0+0+0+0","v":0},1,null,null,null,null,null,null,null,null,null,null,null,null,null,null,null,null,null,null,null,null,null,null,null,null,null,null,null,{"$f":"5*$E82","v":0}]
["Yaya Toure - Man City",null,null,null,{"$f":"1+0+0+0","v":1},3,null,null,null,null,null,null,null,null,null,null,null,null,null,null,null,null,null,null,null,null,null,null,null,null,{"$f":"5*$E83","v":5},null,null,null,null,null,null,null,null,null,null,null,null,null,null,null,null,null,null,null,null,null,null,null,null,null,null,null,null,null,null,null,null,null,null,null,null,null,null,{"$f":"5*$E83","v":5},null,{"$f":"5*$E83","v":5}]
[]
["Total Points - April",null,null,null,null,null,{"$f":"SUM(G2:G84)","v":0},110,115,115,155,50,130,145,120,130,125,115,135,110,105,100,175,125,130,110,100,105,150,130,5,115,115,125,140,120,120,105,{"$f":"SUM(AM2:AM84)","v":145},135,20,40,5,105,120,160,100,5,100,110,110,120,120,75,120,105,120,115,130,110,115,115,10,10,120,115,125,0,75,135,{"$f":"SUM(BS2:BS84)","v":5},105,145,115,150,120,5,15,0,115]
[]
[null,null,null,null,null,null,{"$f":"IF(COUNT(G68:G84)=3,\"a\",\"g\")","v":"a"},{"$f":"IF(COUNT(H68:H84)=3,\"a\",\"g\")","v":"a"},"a","a","a","a","a","a","a","a","a","a","a","a","a","a","a","a","a","a","a","a","a","a","a","a","a","a","a","a","a","a","a","a","a","a","a","a","a","a","a","a","a","a","a","a","a","a","a","a","a","a","a","a","a","a","a","a","a","a","a","a","a","a","a",{"$f":"IF(COUNT(BT68:BT84)=3,\"a\",\"g\")","v":"a"},"a","a","a","a","a","a","a","a"]

{"sheet":"May","index":10,"n_rows":84,"n_cols":80,"rows_kept":84,"cut":false,"hidden":false,"merged":[[52,0,52,4],[1,0,1,4],[10,0,10,4],[14,0,14,4],[17,0,17,4],[26,0,26,4],[33,0,33,4],[42,0,42,4],[46,0,46,4],[49,0,49,4],[30,0,30,4]]}
[null,null,null,null,null,null,"Aaron Byrne","Aidan Knight","Aidan Scanlon","Aidan White","Aiden Desch","Alan Boyle","Anastas Popov","Andy Dunne","Anthony Hughes","Barry Healy","Brendan Maguire","Brian Mullen","Brian Prendergast","Brian Sotolongo","Chris Hall","Ciaran O'Hart","Cillian Conway","Colin McAnaspie","Con McSweeney","Conor Horan","Craig Calvert","Dave Green","Dave McGinley","David Bone","David Byrne","David Cooney","David Keavney","Eamon Fox","Fiachra Moynihan","Gareth Pierpoint","Gary McGurk","Gavin Morgan","Gerry Draper","Gerry Moore","Ian Healy","Javier Suarez Barreiro","Jenny Ellis","Joe Behan","Joe O'Hehir","Joe Turner","Jonathan Fox","Keith Horan","Kevin Donohoe","Kevin Philpott","Konstantin Kulev","Kris Stainton","Liam Butler","Liam Geraghty","Maria Jordan","Mike Hall","Niall Carroll","Oisin O'Reilly","Padraic Carney","Pat Jordan","Paul Moore","Paul Prendergast","Paul Stainton","Peter Behan","Phil Doyle","Philip Jordan","Ralph Goodwin","Ray Ellis","Rhona Devlin","Richard Johnston","Sean Moloney","Sean O'Mairtin","Shane Horan","Sharon Behan","Simon Purdue","Siobhan Murphy","Terry Behan","Tiago Moreira","Tom McHugh","Wayne Donovan"]
["Saturday, May 2nd"]
["Leicester City",3,0,"Newcastle United","12:45:00",null,"-",5,5,5,10,"-",5,5,5,5,5,0,10,5,0,5,5,0,5,5,5,5,5,0,"-",5,5,5,5,5,5,5,5,5,"-","-","-",5,5,5,5,"-",0,5,"-",5,5,"-",5,5,5,5,5,5,5,5,"-","-",5,5,0,"-","-",0,"-",5,5,0,5,5,"-","-","-",5]
["Aston Villa",3,2,"Everton","15:00:00",null,"-",0,5,0,0,"-",0,0,5,0,0,0,5,0,5,5,0,0,0,0,0,0,0,0,"-",0,0,0,5,0,5,5,0,0,"-","-","-",5,0,5,0,"-",0,5,"-",0,5,0,5,0,0,10,5,0,0,0,"-","-",0,0,0,"-","-",0,"-",0,0,0,0,0,"-","-","-",0]
["Liverpool",2,1,"QPR","15:00:00",null,"-",5,0,5,5,"-",10,5,0,5,5,5,5,10,5,0,10,5,5,10,0,10,5,5,"-",5,10,5,5,5,10,10,0,0,"-","-","-",5,5,5,5,"-",0,10,"-",0,5,10,5,0,10,0,5,10,5,10,"-","-",5,5,5,"-","-",5,"-",5,5,0,5,0,"-","-","-",10]
["Sunderland",2,1,"Southampton","15:00:00",null,"-",0,0,0,5,"-",0,0,0,0,0,0,0,0,0,0,0,0,0,0,0,0,0,0,"-",0,0,0,0,0,0,10,10,0,"-","-","-",5,0,0,0,"-",0,10,"-",0,0,10,0,0,0,0,0,0,0,0,"-","-",0,0,0,"-","-",0,"-",0,0,0,0,0,"-","-","-",0]
["Swansea City",2,0,"Stoke City","15:00:00",null,"-",5,10,10,0,"-",5,0,0,5,0,5,5,5,0,0,5,0,0,5,5,0,5,5,"-",5,0,0,0,5,0,5,5,0,"-","-","-",10,5,10,5,"-",0,5,"-",5,5,5,5,0,0,0,10,5,10,5,"-","-",10,10,10,"-","-",5,"-",5,0,0,5,5,"-","-","-",5]
["West Ham",1,0,"Burnley","15:00:00",null,"-",5,5,0,5,"-",5,5,0,0,5,10,0,10,10,0,0,5,5,0,5,0,10,5,"-",0,0,5,0,0,0,5,5,0,"-","-","-",5,5,5,10,"-",0,5,"-",5,5,5,5,0,5,5,0,5,0,5,"-","-",0,0,10,"-","-",5,"-",5,0,0,0,0,"-","-","-",10]
["Man United",0,1,"West Brom","17:30:00",null,"-",0,0,0,0,"-",0,0,0,0,0,0,0,0,0,0,0,0,0,0,0,0,0,0,"-",0,0,0,0,0,0,0,0,0,"-","-","-",0,0,0,0,"-",0,0,0,0,0,0,0,0,0,0,0,0,0,0,"-","-",0,0,0,"-","-",0,"-",0,0,0,0,0,"-","-","-",0]
[]
["Sunday, May 3rd"]
["Chelsea",1,0,"Crystal Palace","13:30:00",null,"-",5,5,5,5,"-",5,5,5,5,5,5,5,5,5,5,5,5,5,5,5,5,5,5,"-",5,10,5,5,5,5,5,5,0,"-","-","-",5,5,5,5,"-",0,5,5,5,5,5,5,5,5,5,10,5,5,5,"-","-",5,5,5,"-","-",10,"-",5,5,10,5,5,"-","-","-",5]
["Tottenham",0,1,"Man City","16:00:00",null,"-",5,0,0,0,"-",0,0,0,5,5,5,0,5,0,5,5,10,5,0,5,5,0,5,"-",0,0,5,0,5,0,0,0,0,"-","-","-",0,0,0,0,"-",0,0,0,0,0,0,5,0,0,5,0,5,0,0,"-","-",5,0,10,"-","-",5,"-",5,0,5,5,5,"-","-","-",5]
[]
["Monday, May 4th"]
["Hull City",1,3,"Arsenal","20:00:00",null,"-",10,5,0,10,"-",5,5,0,5,5,10,5,5,5,0,5,5,5,5,10,5,5,10,"-",0,5,5,0,5,0,0,5,5,"-","-","-",0,5,0,5,"-","-",0,5,5,5,5,5,5,5,10,0,10,0,5,"-","-",0,5,5,"-","-",5,"-",0,5,5,5,5,"-","-","-",5]
[]
["Saturday, May 9th"]
["Everton",0,2,"Sunderland","12:45:00",null,"-",0,0,0,"-","-",0,0,0,0,0,0,0,0,0,0,0,0,0,0,0,0,0,0,"-",0,0,0,0,0,0,0,0,0,"-","-","-",0,0,0,0,"-",0,0,"-",0,"-",0,0,0,0,0,0,0,0,0,"-","-",0,0,0,"-",0,0,"-",0,0,0,0,5,"-","-","-",0]
["Aston Villa",1,0,"West Ham","15:00:00",null,"-",5,5,5,"-","-",5,0,5,5,5,5,5,5,10,5,5,5,5,5,5,0,5,0,"-",5,5,5,5,5,5,0,5,0,"-","-","-",5,5,5,5,"-",5,0,10,0,"-",5,0,5,5,0,5,5,5,10,"-","-",0,0,10,"-",5,5,"-",5,0,10,5,5,"-","-","-",5]
["Hull City",0,1,"Burnley","15:00:00",null,"-",0,0,0,"-","-",0,0,0,0,0,0,0,0,0,0,0,0,0,0,0,0,0,0,"-",0,0,0,0,0,0,0,0,0,"-","-","-",0,0,0,0,"-",0,0,0,0,"-",0,0,0,0,0,0,0,0,0,"-","-",0,0,0,"-",0,0,"-",0,0,0,0,0,"-","-","-",0]
["Leicester City",2,0,"Southampton","15:00:00",null,"-",5,5,5,"-","-",5,0,0,0,10,5,5,5,5,5,5,0,0,0,5,0,0,0,"-",5,0,5,5,0,0,0,5,0,"-","-","-",0,0,5,5,"-",0,0,0,0,"-",10,10,5,5,5,5,5,0,5,"-","-",0,0,0,"-",0,0,"-",10,0,0,5,0,"-","-","-",5]
["Newcastle United",1,1,"West Brom","15:00:00",null,"-",0,0,0,"-","-",0,10,5,0,0,0,0,10,0,0,5,0,10,0,0,0,10,0,"-",10,0,0,10,0,0,5,0,5,"-","-","-",0,0,10,0,"-",10,0,0,0,"-",0,0,5,10,0,5,10,5,0,"-","-",0,0,10,"-",0,0,"-",0,0,0,0,0,"-","-","-",10]
["Stoke City",3,0,"Tottenham","15:00:00",null,"-",5,0,0,"-","-",0,0,0,0,0,0,0,0,5,5,0,5,5,0,0,0,0,0,"-",5,5,0,5,0,5,5,5,5,"-","-","-",0,0,5,0,"-",5,0,0,0,"-",0,0,0,0,0,0,0,0,0,"-","-",0,0,0,"-",0,0,"-",5,0,5,0,0,"-","-","-",0]
["Crystal Palace",1,2,"Man United","17:30:00",null,"-",5,0,10,"-","-",5,10,10,10,5,5,10,5,0,0,5,5,10,10,10,10,0,5,"-",0,0,5,10,0,0,10,0,0,"-","-","-",5,10,0,5,"-",10,10,10,5,"-",0,10,10,0,5,0,5,0,0,"-","-",5,10,5,"-",5,5,"-",0,0,5,10,5,"-","-","-",0]
[]
["Sunday, May 10th"]
["Man City",6,0,"QPR","13:30:00",null,"-",5,5,5,"-","-",5,5,5,5,5,5,5,5,5,5,5,5,5,5,5,5,5,5,"-",5,5,5,5,5,5,5,5,5,"-","-","-",5,5,5,5,"-",5,5,5,0,"-",5,0,5,5,5,5,5,5,5,"-","-",5,5,5,"-",5,5,"-",5,5,5,5,5,"-","-","-",5]
["Chelsea",1,1,"Liverpool","16:00:00",null,"-",0,0,0,"-","-",0,10,0,0,0,5,0,0,0,0,0,0,0,0,0,0,0,0,"-",0,0,0,0,10,0,0,0,10,"-","-","-",0,0,0,0,"-",10,0,0,0,"-",0,0,0,0,0,10,0,10,0,"-","-",0,0,10,"-",0,0,"-",0,0,0,0,0,"-","-","-",0]
[]
["Monday, May 11th"]
["Arsenal",0,1,"Swansea City","20:00:00",null,"-",0,0,0,"-","-",0,0,0,0,0,0,0,0,0,0,0,0,0,0,0,0,0,0,"-",0,0,0,0,0,0,0,0,0,"-","-","-",0,0,0,0,"-",0,0,0,0,"-",0,0,0,0,0,0,0,0,0,"-","-",0,0,0,"-",0,0,"-",0,0,0,0,0,"-","-","-",0]
[]
["Saturday, May 16th"]
["Southampton",6,1,"Aston Villa","12:45:00",null,"-",5,0,0,0,"-",5,0,0,0,0,5,0,5,5,0,0,0,5,5,0,5,5,5,"-",0,0,5,0,0,0,5,0,5,"-",0,"-",0,0,5,5,"-","-",5,"-",0,5,0,5,0,0,0,5,0,5,5,"-","-",0,0,5,"-",0,0,"-",5,0,0,0,0,"-","-","-","-"]
["Burnley",0,0,"Stoke City","15:00:00",null,"-",0,0,0,5,"-",5,0,0,0,0,0,0,5,0,0,0,5,0,5,5,0,5,5,"-",0,0,5,0,0,5,0,0,5,"-",0,"-",5,0,0,0,"-","-",0,0,0,0,0,0,0,5,0,0,0,0,0,"-","-",5,0,0,"-",5,0,"-",0,0,0,0,0,"-","-","-","-"]
["QPR",2,1,"Newcastle United","15:00:00",null,"-",0,0,0,0,"-",10,0,0,5,0,10,0,10,5,0,5,0,10,0,5,0,5,10,"-",0,10,10,0,0,0,0,10,5,"-",0,"-",5,5,5,0,"-","-",5,5,5,0,0,0,0,0,0,0,10,5,5,"-","-",5,0,10,"-",5,0,"-",5,0,0,0,0,"-","-","-","-"]
["Sunderland",0,0,"Leicester City","15:00:00",null,"-",5,5,0,0,"-",0,5,5,5,10,0,0,0,0,0,5,5,5,0,0,10,0,0,"-",10,5,5,0,0,5,0,5,0,"-",0,"-",5,5,0,0,"-","-",5,0,0,0,0,0,10,5,0,0,0,5,0,"-","-",0,0,5,"-",10,5,"-",0,0,0,0,5,"-","-","-","-"]
["Tottenham",2,0,"Hull City","15:00:00",null,"-",10,5,5,5,"-",5,5,10,10,10,0,5,5,5,0,10,5,5,5,5,0,10,10,"-",0,0,10,0,5,0,5,0,0,"-",0,"-",5,5,10,5,"-","-",5,10,5,5,0,5,5,10,5,10,10,10,10,"-","-",5,10,10,"-",0,5,"-",10,5,0,5,5,"-","-","-","-"]
["West Ham",1,2,"Everton","15:00:00",null,"-",0,0,0,0,"-",0,0,0,10,0,5,0,0,0,0,10,0,0,0,0,10,0,0,"-",0,5,0,0,5,0,0,0,10,"-",5,"-",10,0,0,0,"-","-",5,0,0,0,0,0,0,0,0,0,10,0,0,"-","-",0,0,0,"-",5,10,"-",0,0,5,0,0,"-","-","-","-"]
["Liverpool",1,3,"Crystal Palace","17:30:00",null,"-",0,0,0,0,"-",0,0,0,0,0,0,0,0,0,0,0,0,0,0,0,0,0,0,"-",0,5,0,0,0,0,0,0,0,"-",0,"-",0,0,0,0,"-","-",0,0,0,0,0,0,5,0,0,0,0,0,0,"-","-",0,0,0,"-",0,0,"-",0,0,0,0,5,"-","-","-","-"]
[]
["Sunday, May 17th"]
["Swansea City",2,4,"Man City","13:30:00",null,"-",5,0,5,5,"-",5,5,0,5,0,5,0,5,0,5,0,5,5,5,0,5,0,5,"-",5,0,5,5,5,5,5,5,5,"-",0,"-",0,5,0,5,"-","-",5,0,5,5,0,5,5,5,5,5,5,5,0,"-","-",10,5,5,"-",5,5,"-",0,0,0,5,5,"-","-","-","-"]
["Man United",1,1,"Arsenal","16:00:00",null,"-",5,10,0,0,"-",0,10,0,10,0,5,10,0,0,10,0,5,0,0,0,0,0,5,"-",5,5,0,5,0,0,10,0,0,"-",0,"-",5,0,0,0,"-","-",0,0,0,10,0,0,0,0,0,0,0,5,0,"-","-",0,0,10,"-",0,0,"-",0,0,10,0,0,"-","-","-","-"]
[]
["Monday, May 18th"]
["West Brom",3,0,"Chelsea","20:00:00",null,"-",0,0,0,0,"-",0,0,0,0,0,0,0,0,5,0,0,0,0,0,0,0,0,0,"-",0,0,0,0,0,0,0,0,0,"-",0,"-",0,0,5,0,"-","-",0,0,0,0,0,0,0,0,0,5,0,0,5,"-","-",0,0,0,"-",0,0,"-",5,0,0,0,0,"-","-","-","-"]
[]
["Wednesday, May 20th"]
["Arsenal",0,0,"Sunderland","19:45:00",null,"-",0,0,0,0,"-",0,0,0,0,0,0,0,0,0,5,0,0,0,5,5,0,0,0,"-",0,0,0,0,0,5,0,5,0,"-",5,"-",0,0,0,0,"-","-",0,0,0,0,0,0,0,0,0,0,0,0,0,"-","-",0,0,0,"-",0,0,"-",0,0,0,0,0,"-","-","-","-"]
[]
["Sunday, May 24th"]
["Arsenal",4,1,"West Brom","15:00:00",null,"-",5,5,5,5,"-",5,5,5,5,5,5,5,5,5,5,5,5,5,5,5,0,5,5,"-",5,5,5,5,5,5,5,5,5,"-","-","-",5,5,5,5,"-","-",5,5,5,5,5,5,5,5,5,5,5,5,5,"-","-",5,5,5,"-",5,5,"-",5,5,5,0,5,"-","-","-","-"]
["Aston Villa",0,1,"Burnley","15:00:00",null,"-",0,0,0,0,"-",0,0,0,10,0,0,0,0,0,0,0,0,0,0,0,0,0,0,"-",0,0,0,0,0,0,0,0,0,"-","-","-",0,0,0,0,"-","-",0,0,0,0,0,0,0,0,0,0,0,0,0,"-","-",0,0,0,"-",0,0,"-",0,0,0,0,0,"-","-","-","-"]
["Chelsea",3,1,"Sunderland","15:00:00",null,"-",10,5,5,5,"-",5,5,5,5,5,5,5,5,5,0,5,5,5,5,5,5,5,5,"-",5,"-",5,5,10,0,5,5,0,"-","-","-",5,10,5,5,"-","-",5,5,5,5,5,5,5,5,5,5,5,5,10,"-","-",5,5,5,"-",5,5,"-",5,5,5,5,5,"-","-","-","-"]
["Crystal Palace",1,0,"Swansea City","15:00:00",null,"-",0,0,0,0,"-",0,5,5,0,0,10,0,5,5,5,0,0,5,5,0,0,5,5,"-",5,"-",0,5,5,0,10,5,0,"-","-","-",0,5,5,10,"-","-",5,10,5,5,5,0,5,0,5,5,5,0,10,"-","-",0,5,0,"-",0,0,"-",5,10,0,5,0,"-","-","-","-"]
["Everton",0,1,"Tottenham","15:00:00",null,"-",0,0,5,5,"-",0,0,0,0,0,0,0,0,0,0,0,5,0,0,0,5,0,0,"-",0,"-",0,0,0,0,0,0,0,"-","-","-",0,0,0,0,"-","-",0,0,0,0,0,0,0,0,5,0,5,0,0,"-","-",0,0,0,"-",0,5,"-",0,0,0,0,5,"-","-","-","-"]
["Hull City",0,0,"Man United","15:00:00",null,"-",0,0,5,0,"-",0,5,0,0,0,0,0,0,0,5,0,0,5,0,0,0,0,0,"-",0,"-",0,0,0,5,0,0,0,"-","-","-",0,10,0,0,"-","-",0,0,0,0,0,0,0,0,0,0,0,0,0,"-","-",0,0,0,"-",0,0,"-",0,0,0,0,0,"-","-","-","-"]
["Leicester City",5,1,"QPR","15:00:00",null,"-",5,5,5,5,"-",5,5,5,5,5,0,5,0,5,0,5,5,5,5,5,0,5,5,"-",5,"-",5,5,5,5,0,5,5,"-","-","-",5,5,5,5,"-","-",5,5,0,5,5,5,5,5,5,5,5,0,5,"-","-",0,5,5,"-",0,5,"-",5,"-",5,5,5,"-","-","-","-"]
["Man City",2,0,"Southampton","15:00:00",null,"-",0,0,5,5,"-",10,5,5,10,5,10,10,10,5,5,5,10,10,0,0,0,10,5,"-",5,"-",5,5,5,5,5,10,5,"-","-","-",5,0,10,10,"-","-",10,0,10,10,5,5,5,5,5,10,5,5,5,"-","-",5,5,5,"-",5,0,"-",10,"-",5,5,5,"-","-","-","-"]
["Newcastle United",2,0,"West Ham","15:00:00",null,"-",0,0,0,5,"-",0,0,5,0,0,5,5,0,5,10,0,5,0,0,0,0,0,5,"-",5,"-",5,0,5,0,0,0,0,"-","-","-",0,0,0,5,"-","-",5,5,0,0,0,0,0,0,5,5,0,0,0,"-","-",0,0,0,"-",0,0,"-",10,"-",0,5,0,"-","-","-","-"]
["Stoke City",6,1,"Liverpool","15:00:00",null,"-",0,5,0,5,"-",5,0,5,5,5,0,5,5,0,5,5,0,5,5,5,0,0,5,"-",5,"-",0,0,5,5,5,5,0,"-","-","-",5,5,5,0,"-","-",0,5,0,5,0,0,0,5,0,0,0,0,0,"-","-",5,0,0,"-",0,5,"-","-","-",5,5,5,"-","-","-","-"]
[]
["Golden Boots"]
["Alexis Sanchez - Arsenal",null,null,null,{"$f":"2+0+0+0+0","v":2},{"$f":"COUNT(G66:CB66)","v":14},null,{"$f":"5*$E66","v":10},null,null,null,null,null,{"$f":"5*$E66","v":10},null,null,null,null,null,{"$f":"5*$E66","v":10},null,null,null,null,{"$f":"5*$E66","v":10},{"$f":"5*$E66","v":10},null,null,{"$f":"5*$E66","v":10},null,null,null,null,null,null,null,null,null,null,null,null,null,{"$f":"5*$E66","v":10},null,{"$f":"5*$E66","v":10},null,null,null,null,null,null,{"$f":"5*$E66","v":10},null,null,null,null,null,{"$f":"5*$E66","v":10},null,null,null,null,{"$f":"5*$E66","v":10},{"$f":"5*$E66","v":10},null,null,null,null,null,null,null,null,null,{"$f":"5*$E66","v":10},null,null,null,{"$f":"5*$E66","v":10}]
["Daniel Sturridge - Liverpool",null,null,null,{"$f":"0+0+0+0","v":0},52,{"$f":"5*$E67","v":0},null,{"$f":"5*$E67","v":0},{"$f":"5*$E67","v":0},{"$f":"5*$E67","v":0},null,{"$f":"5*$E67","v":0},{"$f":"5*$E67","v":0},{"$f":"5*$E67","v":0},{"$f":"5*$E67","v":0},{"$f":"5*$E67","v":0},{"$f":"5*$E67","v":0},{"$f":"5*$E67","v":0},null,null,{"$f":"5*$E67","v":0},{"$f":"5*$E67","v":0},{"$f":"5*$E67","v":0},null,{"$f":"5*$E67","v":0},{"$f":"5*$E67","v":0},{"$f":"5*$E67","v":0},null,null,{"$f":"5*$E67","v":0},{"$f":"5*$E67","v":0},{"$f":"5*$E67","v":0},null,{"$f":"5*$E67","v":0},0,0,0,0,null,0,0,null,{"$f":"5*$E67","v":0},{"$f":"5*$E67","v":0},null,{"$f":"5*$E67","v":0},{"$f":"5*$E67","v":0},null,{"$f":"5*$E67","v":0},{"$f":"5*$E67","v":0},null,{"$f":"5*$E67","v":0},{"$f":"5*$E67","v":0},{"$f":"5*$E67","v":0},{"$f":"5*$E67","v":0},{"$f":"5*$E67","v":0},{"$f":"5*$E67","v":0},null,null,{"$f":"5*$E67","v":0},{"$f":"5*$E67","v":0},{"$f":"5*$E67","v":0},0,{"$f":"5*$E67","v":0},null,null,null,{"$f":"5*$E67","v":0},null,{"$f":"5*$E67","v":0},{"$f":"5*$E67","v":0},{"$f":"5*$E67","v":0},null,{"$f":"5*$E67","v":0},{"$f":"5*$E67","v":0},null,null,{"$f":"5*$E67","v":0},{"$f":"5*$E67","v":0}]
["Diego Costa - Chelsea",null,null,null,{"$f":"0+0+0+1","v":1},39,null,{"$f":"5*$E68","v":5},null,5,null,{"$f":"5*$E68","v":5},{"$f":"5*$E68","v":5},null,5,{"$f":"5*$E68","v":5},null,null,{"$f":"5*$E68","v":5},{"$f":"5*$E68","v":5},null,null,null,null,null,{"$f":"5*$E68","v":5},null,{"$f":"5*$E68","v":5},{"$f":"5*$E68","v":5},null,5,{"$f":"5*$E68","v":5},{"$f":"5*$E68","v":5},{"$f":"5*$E68","v":5},null,{"$f":"5*$E68","v":5},{"$f":"5*$E68","v":5},null,null,null,{"$f":"5*$E68","v":5},{"$f":"5*$E68","v":5},null,{"$f":"5*$E68","v":5},null,{"$f":"5*$E68","v":5},5,{"$f":"5*$E68","v":5},{"$f":"5*$E68","v":5},null,null,{"$f":"5*$E68","v":5},{"$f":"5*$E68","v":5},{"$f":"5*$E68","v":5},null,{"$f":"5*$E68","v":5},null,{"$f":"5*$E68","v":5},{"$f":"5*$E68","v":5},{"$f":"5*$E68","v":5},{"$f":"5*$E68","v":5},null,null,null,null,{"$f":"5*$E68","v":5},{"$f":"5*$E68","v":5},{"$f":"5*$E68","v":5},null,{"$f":"5*$E68","v":5},null,null,null,null,null,null,null,{"$f":"5*$E68","v":5},{"$f":"5*$E68","v":5},5]
["Eden Hazard - Chelsea",null,null,null,{"$f":"1+0+0+0","v":1},2,null,null,null,null,{"$f":"5*$E69","v":5},null,null,null,null,null,null,null,null,null,null,null,null,null,null,null,null,null,null,null,null,null,null,null,null,null,null,null,null,null,null,null,null,null,null,null,null,null,null,null,null,null,null,null,null,null,null,null,null,null,null,null,null,null,null,null,null,null,null,null,null,null,null,null,null,{"$f":"5*$E69","v":5}]
["Edin Dzeko - Man City",null,null,null,{"$f":"0+0+0+0","v":0},6,null,null,null,null,null,{"$f":"5*$E70","v":0},null,null,null,null,null,null,null,null,null,null,null,null,null,null,null,{"$f":"5*$E70","v":0},null,null,null,null,null,null,null,null,null,null,null,null,null,null,{"$f":"5*$E70","v":0},null,null,{"$f":"5*$E70","v":0},null,null,null,null,null,null,null,null,null,null,null,null,null,null,null,null,null,null,null,null,null,{"$f":"5*$E70","v":0},null,null,null,null,null,{"$f":"5*$E70","v":0}]
["Emmanuel Adebayor - Tottenham",null,null,null,{"$f":"0+0+0+0","v":0},3,null,null,null,null,null,null,null,null,null,null,null,null,null,null,{"$f":"5*$E71","v":0},null,null,null,null,null,null,null,null,null,null,null,null,null,null,null,null,null,null,{"$f":"5*$E71","v":0},null,null,null,null,null,null,null,null,null,null,null,null,null,null,null,null,null,null,null,null,null,null,null,null,null,null,null,null,null,null,{"$f":"5*$E71","v":0}]
["Olivier Giroud - Arsenal",null,null,null,{"$f":"0+0+0+0+0","v":0},4,null,null,null,null,null,{"$f":"5*$E72","v":0},null,null,null,null,null,null,null,null,null,null,null,null,null,null,null,null,null,{"$f":"5*$E72","v":0},null,null,null,null,null,null,null,null,null,0,null,null,null,null,null,null,null,{"$f":"5*$E72","v":0}]
["Raheem Sterling - Liverpool",null,null,null,{"$f":"0+0+0+0","v":0},3,null,null,null,null,null,null,null,null,null,null,null,null,null,null,null,null,null,null,null,null,null,null,null,null,null,null,null,null,null,null,null,null,null,null,null,null,null,null,null,{"$f":"5*$E73","v":0},null,null,null,null,null,null,null,null,null,null,null,null,null,null,null,null,null,null,null,null,null,null,{"$f":"5*$E73","v":0},null,null,null,{"$f":"5*$E73","v":0}]
["Robin van Persie - Man United",null,null,null,{"$f":"0+0+0+0","v":0},45,{"$f":"5*$E74","v":0},{"$f":"5*$E74","v":0},null,{"$f":"5*$E74","v":0},null,null,null,null,null,{"$f":"5*$E74","v":0},{"$f":"5*$E74","v":0},{"$f":"5*$E74","v":0},{"$f":"5*$E74","v":0},null,{"$f":"5*$E74","v":0},{"$f":"5*$E74","v":0},null,{"$f":"5*$E74","v":0},{"$f":"5*$E74","v":0},null,{"$f":"5*$E74","v":0},null,null,{"$f":"5*$E74","v":0},null,{"$f":"5*$E74","v":0},{"$f":"5*$E74","v":0},{"$f":"5*$E74","v":0},{"$f":"5*$E74","v":0},{"$f":"5*$E74","v":0},null,{"$f":"5*$E74","v":0},{"$f":"5*$E74","v":0},null,null,{"$f":"5*$E74","v":0},{"$f":"5*$E74","v":0},{"$f":"5*$E74","v":0},null,null,{"$f":"5*$E74","v":0},null,{"$f":"5*$E74","v":0},{"$f":"5*$E74","v":0},{"$f":"5*$E74","v":0},null,{"$f":"5*$E74","v":0},{"$f":"5*$E74","v":0},{"$f":"5*$E74","v":0},{"$f":"5*$E74","v":0},{"$f":"5*$E74","v":0},null,{"$f":"5*$E74","v":0},{"$f":"5*$E74","v":0},{"$f":"5*$E74","v":0},{"$f":"5*$E74","v":0},null,null,{"$f":"5*$E74","v":0},{"$f":"5*$E74","v":0},{"$f":"5*$E74","v":0},{"$f":"5*$E74","v":0},null,{"$f":"5*$E74","v":0},null,{"$f":"5*$E74","v":0},null,null,null,{"$f":"5*$E74","v":0},{"$f":"5*$E74","v":0},null,{"$f":"5*$E74","v":0}]
["Romelu Lukaku - Everton",null,null,null,{"$f":"1+0+1+0","v":2},7,{"$f":"5*$E75","v":10},null,{"$f":"5*$E75","v":10},null,null,null,null,null,null,null,null,null,null,{"$f":"5*$E75","v":10},{"$f":"5*$E75","v":10},null,null,null,null,null,null,null,null,null,null,null,null,null,null,null,null,null,null,null,null,null,null,null,null,null,null,null,null,{"$f":"5*$E75","v":10},null,null,null,null,null,null,null,null,null,null,null,null,null,null,null,null,null,null,null,null,null,null,null,null,null,null,{"$f":"5*$E75","v":10},{"$f":"5*$E75","v":10}]
["Sergio Aguero - Man City",null,null,null,{"$f":"1+3+0+1","v":5},21,null,null,null,null,null,null,{"$f":"5*$E76","v":25},{"$f":"5*$E76","v":25},null,null,{"$f":"5*$E76","v":25},{"$f":"5*$E76","v":25},null,null,null,null,{"$f":"5*$E76","v":25},{"$f":"5*$E76","v":25},{"$f":"5*$E76","v":25},null,null,null,{"$f":"5*$E76","v":25},{"$f":"5*$E76","v":25},null,null,null,null,{"$f":"5*$E76","v":25},null,{"$f":"5*$E76","v":25},{"$f":"5*$E76","v":25},{"$f":"5*$E76","v":25},{"$f":"5*$E76","v":25},{"$f":"5*$E76","v":25},null,null,null,null,null,null,null,null,null,{"$f":"5*$E76","v":25},null,null,null,{"$f":"5*$E76","v":25},null,null,null,{"$f":"5*$E76","v":25},null,null,{"$f":"5*$E76","v":25},null,null,null,null,{"$f":"5*$E76","v":25},null,null,null,null,null,null,null,{"$f":"5*$E76","v":25}]
["Steven Gerrard - Liverpool",null,null,null,{"$f":"1+1+0+1","v":3},1,null,null,null,null,null,null,null,null,null,null,null,null,null,null,null,null,null,null,null,null,null,null,null,null,null,null,null,null,null,null,null,null,null,null,null,null,null,null,null,null,null,null,null,null,null,null,null,null,null,null,null,null,null,null,null,null,null,null,null,null,null,null,{"$f":"5*$E77","v":15}]
["Wayne Rooney - Man United",null,null,null,{"$f":"0+0+0+0","v":0},21,null,null,{"$f":"5*$E78","v":0},null,{"$f":"5*$E78","v":0},null,null,null,{"$f":"5*$E78","v":0},null,null,null,null,null,null,{"$f":"5*$E78","v":0},{"$f":"5*$E78","v":0},null,null,null,{"$f":"5*$E78","v":0},null,null,null,null,null,null,null,null,null,null,null,null,null,null,null,null,null,{"$f":"5*$E78","v":0},null,null,null,{"$f":"5*$E78","v":0},null,null,{"$f":"5*$E78","v":0},null,null,null,null,{"$f":"5*$E78","v":0},null,null,{"$f":"5*$E78","v":0},null,null,{"$f":"5*$E78","v":0},{"$f":"5*$E78","v":0},{"$f":"5*$E78","v":0},{"$f":"5*$E78","v":0},null,null,null,null,{"$f":"5*$E78","v":0},null,{"$f":"5*$E78","v":0},{"$f":"5*$E78","v":0},{"$f":"5*$E78","v":0},null,{"$f":"5*$E78","v":0},null,null,{"$f":"5*$E78","v":0}]
["Wilfried Bony - Swansea Man City",null,null,null,{"$f":"0+0+1+0","v":1},1,null,null,null,null,null,null,null,null,null,null,null,null,null,null,null,null,null,null,null,null,null,null,null,null,null,null,null,{"$f":"5*$E79","v":5}]
["Yaya Toure - Man City",null,null,null,{"$f":"0+0+2+0","v":2},3,null,null,null,null,null,null,null,null,null,null,null,null,null,null,null,null,null,null,null,null,null,null,null,null,{"$f":"5*$E80","v":10},null,null,null,null,null,null,null,null,null,null,null,null,null,null,null,null,null,null,null,null,null,null,null,null,null,null,null,null,null,null,null,null,null,null,null,null,null,null,{"$f":"5*$E80","v":10},null,{"$f":"5*$E80","v":10}]
[]
["Total Points - May",null,null,null,null,null,{"$f":"SUM(G2:G81)","v":10},{"$f":"SUM(H2:H81)","v":130},100,95,95,5,145,150,95,140,125,155,115,160,115,95,140,135,170,115,100,90,150,145,15,110,85,125,120,110,115,150,140,105,30,15,10,120,120,130,115,5,50,135,110,85,100,90,120,100,105,115,155,145,105,140,10,10,85,90,180,5,75,115,0,{"$f":"SUM(BT2:BT81)","v":130},50,95,120,100,10,25,5,75]
[]
[null,null,null,null,null,null,{"$f":"IF(COUNT(G65:G81)=3,\"a\",\"g\")","v":"a"},{"$f":"IF(COUNT(H65:H81)=3,\"a\",\"g\")","v":"a"},"a","a","a","a","a","a","a","a","a","a","a","a","a","a","a","a","a","a","a","a","a","a","a","a","a","a","a","a","a","a","a","a","a","a","a","a","a","a","a","a","a","a","a","a","a","a","a","a","a","a","a","a","a","a","a","a","a","a","a","a","a","a","a",{"$f":"IF(COUNT(BT65:BT81)=3,\"a\",\"g\")","v":"a"},"a","a","a","a","a","a","a","a"]

{"sheet":"Jokers","index":11,"n_rows":75,"n_cols":35,"rows_kept":75,"cut":false,"hidden":false,"merged":[]}
["No.","Player","Team Name","Joker",1,2,3,4,5,6,7,8,9,10,11,12,13,14,15,16,17,18,19,20,21,22,23,24,25,26,27,28,29,30,"Used?"]
[1,"Aaron Byrne","Crash n Byrne","2-1","a","a","a","a","a","a","a","a","a","a","a","a","a","a","a","a","a","a","a","a","a","a","a","a","a","a","a","a","a","a",{"$f":"COUNTIF(E2:AH2,\"a\")","v":30}]
[2,"Aidan Knight","Unaganaguna","2-0","a","a","a","a","a","a","a","a","a","a","a","a",null,null,null,null,null,null,null,null,null,null,null,null,null,null,null,null,null,null,12]
[3,"Aidan Scanlon","Kilflynn Santos","2-0","a","a","a","a","a","a","a","a","a","a",null,null,null,null,null,null,null,null,null,null,null,null,null,null,null,null,null,null,null,null,10]
[4,"Aidan White","Lambert's Puppet Theatre","1-0","a","a","a","a","a","a","a","a","a","a","a","a","a","a","a","a",null,null,null,null,null,null,null,null,null,null,null,null,null,null,16]
[5,"Aiden Desch","Yid Army","2-1","a","a","a","a","a","a","a","a","a","a","a","a","a","a","a","a","a","a","a","a","a","a","a","a","a","a","a","a","a","a",30]
[6,"Alan Boyle","What For Ref?","1-0","a","a","a","a","a","a","a","a","a","a","a","a","a","a","a","a","a","a","a","a","a","a","a","a","a","a","a","a","a","a",30]
[7,"Anastas Popov","FC Botev","1-0","a","a","a","a",null,null,null,null,null,null,null,null,null,null,null,null,null,null,null,null,null,null,null,null,null,null,null,null,null,null,4]
[8,"Andy Dunne","AC Pozallo","2-0","a","a","a","a","a","a","a","a","a","a","a",null,null,null,null,null,null,null,null,null,null,null,null,null,null,null,null,null,null,null,11]
[9,"Anthony Hughes","Tekkerslovakia","2-1","a","a","a","a","a","a","a","a","a","a","a","a","a","a","a","a","a","a","a","a","a",null,null,null,null,null,null,null,null,null,21]
[10,"Barry Healy","Dangleberries United",null,null,null,null,null,null,null,null,null,null,null,null,null,null,null,null,null,null,null,null,null,null,null,null,null,null,null,null,null,null,null,0]
[11,"Brendan Maguire","Back on Top",null,null,null,null,null,null,null,null,null,null,null,null,null,null,null,null,null,null,null,null,null,null,null,null,null,null,null,null,null,null,null,0]
[12,"Brian Mullen","Plumbers Mate","2-0","a","a","a","a","a","a","a","a","a","a","a","a","a","a","a","a","a","a","a","a","a","a","a","a","a","a","a","a",null,null,28]
[13,"Brian Prendergast","Gunnersaurus","2-1","a","a","a","a","a","a","a","a","a","a","a","a","a","a","a","a","a","a","a","a","a",null,null,null,null,null,null,null,null,null,21]
[14,"Brian Sotolongo","Punchin' Horses For Fun","2-1","a","a","a","a","a","a","a","a","a","a","a","a","a","a","a",null,null,null,null,null,null,null,null,null,null,null,null,null,null,null,15]
[15,"Chris Hall","Kangaroo Court","1-0","a","a","a","a","a","a","a","a","a","a","a","a","a","a","a","a","a","a","a","a","a",null,null,null,null,null,null,null,null,null,21]
[16,"Ciaran O'Hart","Riverchapel Plate",null,null,null,null,null,null,null,null,null,null,null,null,null,null,null,null,null,null,null,null,null,null,null,null,null,null,null,null,null,null,null,0]
[17,"Cillian Conway","Big Dick Dunne XI","1-1","a","a","a","a","a","a","a","a","a","a","a","a","a","a","a","a","a","a","a","a",null,null,null,null,null,null,null,null,null,null,20]
[18,"Colin McAnaspie","AC A Little Silhouette of Milan","2-1","a",null,null,null,null,null,null,null,null,null,null,null,null,null,null,null,null,null,null,null,null,null,null,null,null,null,null,null,null,null,1]
[19,"Con McSweeney","Glassey_Alleys","2-0","a",null,null,null,null,null,null,null,null,null,null,null,null,null,null,null,null,null,null,null,null,null,null,null,null,null,null,null,null,null,1]
[20,"Conor Horan","Ricky Lamb Legs",null,null,null,null,null,null,null,null,null,null,null,null,null,null,null,null,null,null,null,null,null,null,null,null,null,null,null,null,null,null,null,0]
[21,"Craig Calvert","Red Van Man",null,null,null,null,null,null,null,null,null,null,null,null,null,null,null,null,null,null,null,null,null,null,null,null,null,null,null,null,null,null,null,0]
[22,"Dave Green","Hope It's This Year",null,null,null,null,null,null,null,null,null,null,null,null,null,null,null,null,null,null,null,null,null,null,null,null,null,null,null,null,null,null,null,0]
[23,"Dave McGinley","Reservoir Dubs",null,null,null,null,null,null,null,null,null,null,null,null,null,null,null,null,null,null,null,null,null,null,null,null,null,null,null,null,null,null,null,0]
[24,"David Bone","Brunton Blues","2-1","a","a","a","a","a","a","a","a","a","a",null,null,null,null,null,null,null,null,null,null,null,null,null,null,null,null,null,null,null,null,10]
[25,"David Byrne","In Parry I Trust","2-0","a","a","a","a","a","a","a","a","a","a","a","a","a","a","a","a","a","a","a","a","a","a","a","a","a","a","a","a","a","a",30]
[26,"David Cooney","Ranaghan City","2-1","a","a","a","a","a","a","a","a","a","a",null,null,null,null,null,null,null,null,null,null,null,null,null,null,null,null,null,null,null,null,10]
[27,"David Keavney","YaJokinArnYa","1-0","a","a","a","a","a","a","a","a","a","a","a","a","a","a","a","a","a","a","a","a","a","a","a","a","a","a","a","a","a","a",30]
[28,"Eamon Fox","Saoirkat",null,null,null,null,null,null,null,null,null,null,null,null,null,null,null,null,null,null,null,null,null,null,null,null,null,null,null,null,null,null,null,0]
[29,"Fiachra Moynihan","What's Another Year","1-0","a","a","a","a","a","a","a","a","a","a","a",null,null,null,null,null,null,null,null,null,null,null,null,null,null,null,null,null,null,null,11]
[30,"Gareth Pierpoint","Pierpoint's Poodles","3-1","a","a","a","a","a","a","a","a","a","a","a","a","a","a","a","a",null,null,null,null,null,null,null,null,null,null,null,null,null,null,16]
[31,"Gary McGurk","Barksdale's Crew","2-0","a","a","a","a","a","a","a","a","a","a",null,null,null,null,null,null,null,null,null,null,null,null,null,null,null,null,null,null,null,null,10]
[32,"Gavin Morgan","Route One","2-1","a","a","a","a","a","a","a","a","a","a",null,null,null,null,null,null,null,null,null,null,null,null,null,null,null,null,null,null,null,null,10]
[33,"Gerry Draper","Everton 10",null,null,null,null,null,null,null,null,null,null,null,null,null,null,null,null,null,null,null,null,null,null,null,null,null,null,null,null,null,null,null,{"$f":"COUNTIF(E34:AH34,\"a\")","v":0}]
[34,"Gerry Moore","Gunning For Title","2-1","a","a","a","a","a","a","a","a","a","a","a","a","a","a","a","a",null,null,null,null,null,null,null,null,null,null,null,null,null,null,16]
[35,"Ian Healy","Foffyz Fuzz","2-0","a","a","a","a","a","a","a","a","a","a","a","a","a","a","a","a","a","a","a","a","a","a","a","a","a","a","a","a","a","a",30]
[36,"Javier Suarez Barreiro","Tiki Taka","1-0","a","a","a","a","a","a","a","a","a","a","a","a","a","a","a","a","a","a","a","a","a","a","a","a","a","a","a","a","a","a",30]
[37,"Jenny Ellis","Ellis Eleven","1-0","a","a","a","a","a","a","a","a","a","a","a","a","a","a","a","a","a","a","a","a","a","a","a","a","a","a","a","a","a","a",30]
[38,"Joe Behan","Melchester Rovers","2-0","a","a","a","a","a","a","a","a","a","a",null,null,null,null,null,null,null,null,null,null,null,null,null,null,null,null,null,null,null,null,10]
[39,"Joe O'Hehir","Louis De First","2-0","a",null,null,null,null,null,null,null,null,null,null,null,null,null,null,null,null,null,null,null,null,null,null,null,null,null,null,null,null,null,1]
[40,"Joe Turner","While My Qatar Gently Weeps",null,null,null,null,null,null,null,null,null,null,null,null,null,null,null,null,null,null,null,null,null,null,null,null,null,null,null,null,null,null,null,0]
[41,"Jonathan Fox","Lallanas In Pajamas",null,null,null,null,null,null,null,null,null,null,null,null,null,null,null,null,null,null,null,null,null,null,null,null,null,null,null,null,null,null,null,0]
[42,"Keith Horan","Death By Football","2-0","a","a","a","a","a","a","a","a","a","a","a","a","a","a","a","a","a","a","a","a","a","a","a","a","a","a","a","a","a","a",30]
[43,"Kevin Donohoe","LTFC","1-1","a","a","a","a","a","a","a","a","a","a","a","a","a","a","a","a","a","a","a","a","a","a","a","a","a","a","a","a","a","a",30]
[44,"Kevin Philpott","Kevin van Philpott","2-1","a","a","a","a","a","a","a","a","a","a","a","a","a","a","a","a","a","a","a","a",null,null,null,null,null,null,null,null,null,null,20]
[45,"Konstantin Kulev","Benkovski Byala","1-0","a","a","a","a","a","a","a","a","a","a","a","a","a","a","a","a","a","a","a","a","a","a","a","a","a","a","a","a","a","a",30]
[46,"Kris Stainton","Van Gaal's Galore","1-0","a",null,null,null,null,null,null,null,null,null,null,null,null,null,null,null,null,null,null,null,null,null,null,null,null,null,null,null,null,null,1]
[47,"Liam Butler","Happy Hammers","2-1","a","a","a","a","a","a","a","a","a","a","a","a","a","a","a","a","a","a","a","a","a","a","a","a","a","a","a","a","a","a",30]
[48,"Liam Geraghty","All Aboard Jose's Big Blue Bus","2-1","a","a","a","a","a","a","a","a","a","a","a","a","a","a","a","a","a","a","a","a","a","a","a","a","a","a","a","a","a","a",30]
[49,"Maria Jordan","Ria's Rovers",null,null,null,null,null,null,null,null,null,null,null,null,null,null,null,null,null,null,null,null,null,null,null,null,null,null,null,null,null,null,null,0]
[50,"Mike Hall","Azpilicueta We Call Him Dave","1-0","a","a","a","a","a","a","a","a","a","a","a","a","a","a","a","a","a","a","a","a","a","a","a","a","a","a","a",null,null,null,27]
[51,"Niall Carroll","Baker's Corner","2-0","a","a","a","a","a","a","a","a","a","a","a","a","a","a","a","a","a","a","a","a","a","a","a","a","a","a","a","a","a","a",30]
[52,"Oisin O'Reilly","Battle Cruiser","2-0","a","a","a","a","a","a","a",null,null,null,null,null,null,null,null,null,null,null,null,null,null,null,null,null,null,null,null,null,null,null,7]
[53,"Padraic Carney","Sheep Shaggers","2-0","a","a",null,null,null,null,null,null,null,null,null,null,null,null,null,null,null,null,null,null,null,null,null,null,null,null,null,null,null,null,2]
[54,"Pat Jordan","Zac Attack","2-1","a","a","a","a","a","a","a","a","a","a",null,null,null,null,null,null,null,null,null,null,null,null,null,null,null,null,null,null,null,null,10]
[55,"Paul Moore","\"We Go To Norwich\"",null,null,null,null,null,null,null,null,null,null,null,null,null,null,null,null,null,null,null,null,null,null,null,null,null,null,null,null,null,null,null,0]
[56,"Paul Prendergast","The Untouchables","2-0","a","a","a","a","a","a","a","a","a","a","a","a","a","a","a","a","a","a","a","a","a","a","a","a","a",null,null,null,null,null,25]
[57,"Paul Stainton","Don't Slip Stevie","2-0","a","a","a","a","a","a","a","a","a","a","a","a","a","a","a","a","a","a","a","a","a","a","a","a","a","a","a","a","a","a",30]
[58,"Peter Behan","FC Nerazzuri","2-1","a","a","a","a","a","a","a","a","a","a","a","a","a","a","a","a","a","a","a","a","a","a","a","a","a","a","a","a","a","a",30]
[59,"Phil Doyle","FC Muertos Vivientes Goteo de Snr Z",null,null,null,null,null,null,null,null,null,null,null,null,null,null,null,null,null,null,null,null,null,null,null,null,null,null,null,null,null,null,null,0]
[60,"Philip Jordan","Vale 46",null,null,null,null,null,null,null,null,null,null,null,null,null,null,null,null,null,null,null,null,null,null,null,null,null,null,null,null,null,null,null,0]
[61,"Ralph Goodwin","Sky Blue Army","1-0","a","a","a","a","a","a","a","a","a","a","a","a","a","a","a","a","a","a","a","a","a","a","a","a","a","a","a","a","a","a",30]
[62,"Ray Ellis","Hodge Ball FC","1-0","a","a","a","a","a","a","a","a","a","a","a","a","a","a","a","a","a","a","a","a","a","a","a","a","a","a","a","a","a","a",30]
[63,"Rhona Devlin","LFC Rhoz","2-1","a","a","a","a","a","a","a","a","a","a","a","a","a","a","a","a","a","a","a","a","a","a","a","a","a","a","a","a","a","a",30]
[64,"Richard Johnston","Let There Be No Panic","1-0","a","a","a","a","a","a","a","a","a","a","a","a","a","a","a","a","a","a","a",null,null,null,null,null,null,null,null,null,null,null,19]
[65,"Sean Moloney","66/1 Outsider","2-0","a","a","a","a","a","a","a","a","a","a","a","a","a","a","a","a","a","a","a","a","a","a","a","a","a","a","a","a","a","a",{"$f":"COUNTIF(E66:AH66,\"a\")","v":30}]
[66,"Sean O'Mairtin","Creweless","2-0","a","a","a","a","a","a","a","a","a","a","a","a","a","a","a","a","a","a","a","a","a","a","a","a","a","a","a","a","a","a",30]
[67,"Shane Horan","ShaneyHoransFC","1-0","a","a","a","a","a","a","a","a","a","a","a","a","a","a","a","a","a","a","a","a","a","a","a","a","a","a","a","a","a","a",30]
[68,"Sharon Behan","Holly's Heroes","2-1","a","a","a","a","a","a","a","a","a","a","a","a","a","a","a","a","a","a","a","a","a","a","a","a","a","a","a","a","a",null,29]
[69,"Simon Purdue","Game of Throw-Ins","2-1",null,null,null,null,null,null,null,null,null,null,null,null,null,null,null,null,null,null,null,null,null,null,null,null,null,null,null,null,null,null,0]
[70,"Siobhan Murphy","Kopout","2-1","a","a","a","a","a","a","a","a","a","a",null,null,null,null,null,null,null,null,null,null,null,null,null,null,null,null,null,null,null,null,10]
[71,"Terry Behan","Utd4Ever","2-0","a","a","a","a","a","a","a","a","a","a","a","a","a","a","a","a","a","a","a","a","a","a","a","a","a","a","a","a","a","a",30]
[72,"Tiago Moreira","Moriera United","2-2","a","a","a","a","a","a","a","a","a","a","a","a","a","a","a","a","a","a","a","a","a","a","a","a","a","a","a","a","a","a",30]
[73,"Tom McHugh","Crystal Pulis","2-1","a","a","a","a","a","a","a","a","a","a","a","a","a","a","a","a","a","a","a","a","a","a","a","a","a","a","a","a","a","a",30]
[74,"Wayne Donovan","Thy Kingdom Come","2-1","a","a","a","a","a","a","a","a","a","a","a","a","a","a","a","a","a","a","a","a","a","a","a","a","a","a","a","a","a","a",30]